{"text_format":"1","workbook":"xlsx","n_sheets":3,"sheets":["Hoja1","Hoja4","Hoja2"],"not_rendered":{"charts":0,"images":2,"macros":1,"external_links":0,"defined_names":340,"comments":0,"pivot_tables":0},"unopened":[],"bounds":{"document_bytes":16777216,"sheet_cells":100000,"rows_first":2000,"rows_last":500,"rows_between":2000,"halvings":0,"cell_chars":16384,"cell_head_chars":4096},"cells_cut":0,"cells_raw":0,"read":"whole","date_system":"1900"}

{"sheet":"Hoja1","index":0,"n_rows":1008,"n_cols":358,"rows_kept":1008,"cut":false,"hidden":true,"merged":[[0,2,0,11],[2,6,2,7],[6,5,6,6],[6,8,6,9],[3,6,3,8]]}
[null,null,"FORMULARIO DE ENTREGA RINCON DE JUEGOS (RINJU)",null,null,null,null,null,null,null,null,null,null,null,"niño",{"$f":"dvrut(F9)","v":0},{"$f":"IF(OR(ISBLANK(F9),ISBLANK(G9)),2,IF(P1=G9,1,0))","v":2},null,null,"COMUNAS",null,"AISEN","ALGARROBO","ALHUE","ALTO BIOBIO","ALTO DEL CARMEN","ALTO HOSPICIO","ANCUD","ANDACOLLO","ANGOL","ANTOFAGASTA","ANTUCO","ARAUCO","ARICA","BUIN","BULNES","CABILDO","CABO DE HORNOS","CABRERO","CAÑETE","CALAMA","CALBUCO","CALDERA","CALERA","CALERA DE TANGO","CALLE LARGA","CANELA","CARAHUE","CARTAGENA","CASABLANCA","CASTRO","CATEMU","CAUQUENES","CERRILLOS","CERRO NAVIA","CHAÑARAL","CHAITEN","CHANCO","CHEPICA","CHIGUAYANTE","CHILE CHICO","CHILLAN","CHILLAN VIEJO","CHIMBARONGO","CHOLCHOL","CHONCHI","CISNES","COBQUECURA","COCHAMO","COCHRANE","CODEGUA","COELEMU","COIHAIQUE","COIHUECO","COINCO","COLBUN","COLCHANE","COLINA","COLLIPULLI","COLTAUCO","COMBARBALA","CONCEPCION","CONCHALI","CONCON","CONSTITUCION","CONTULMO","COPIAPO","COQUIMBO","CORONEL","CORRAL","CUNCO","CURACAUTIN","CURACAVI","CURACO DE VELEZ","CURANILAHUE","CURARREHUE","CUREPTO","CURICO","DALCAHUE","DIEGO DE ALMAGRO","ÑIQUEN","DOÑIHUE","ÑUÑOA","EL BOSQUE","EL CARMEN","EL MONTE","EL QUISCO","EL TABO","EMPEDRADO","ERCILLA","ESTACION CENTRAL","FLORIDA","FREIRE","FREIRINA","FRESIA","FRUTILLAR","FUTALEUFU","FUTRONO","GALVARINO","GORBEA","GRANEROS","GUAITECAS","HIJUELAS","HUALAÑE","HUALAIHUE","HUALPEN","HUALQUI","HUARA","HUASCO","HUECHURABA","ILLAPEL","INDEPENDENCIA","IQUIQUE","ISLA DE MAIPO","ISLA DE PASCUA","JUAN FERNANDEZ","LA CISTERNA","LA CRUZ","LA ESTRELLA","LA FLORIDA","LA GRANJA","LA HIGUERA","LA LIGUA","LA PINTANA","LA REINA","LA SERENA","LA UNION","LAGO RANCO","LAJA","LAMPA","LANCO","LAS CABRAS","LAS CONDES","LAUTARO","LEBU","LICANTEN","LIMACHE","LINARES","LITUECHE","LLAILLAY","LLANQUIHUE","LO BARNECHEA","LO ESPEJO","LO PRADO","LOLOL","LONCOCHE","LONGAVI","LONQUIMAY","LOS ALAMOS","LOS ANDES","LOS ANGELES","LOS LAGOS","LOS MUERMOS","LOS SAUCES","LOS VILOS","LOTA","LUMACO","MACHALI","MACUL","MAFIL","MAIPU","MALLOA","MARCHIHUE","MARIA ELENA","MARIA PINTO","MARIQUINA","MAULE","MAULLIN","MEJILLONES","MELIPEUCO","MELIPILLA","MOLINA","MONTE PATRIA","MOSTAZAL","MULCHEN","NACIMIENTO","NANCAGUA","NATALES","NAVIDAD","NEGRETE","NINHUE","NOGALES","NUEVA IMPERIAL","O'HIGGINS","OLIVAR","OLMUE","OSORNO","OVALLE","PADRE HURTADO","PADRE LAS CASAS","PAIGUANO","PAILLACO","PAINE","PALENA","PALMILLA","PANGUIPULLI","PANQUEHUE","PAPUDO","PAREDONES","PARRAL","PEÑAFLOR","PEÑALOLEN","PEDRO AGUIRRE CERDA","PELARCO","PELLUHUE","PEMUCO","PENCAHUE","PENCO","PERALILLO","PERQUENCO","PETORCA","PEUMO","PICA","PICHIDEGUA","PICHILEMU","PINTO","PIRQUE","PITRUFQUEN","PLACILLA","PORTEZUELO","PORVENIR","POZO ALMONTE","PRIMAVERA","PROVIDENCIA","PUCHUNCAVI","PUCON","PUDAHUEL","PUENTE ALTO","PUERTO MONTT","PUERTO OCTAY","PUERTO VARAS","PUMANQUE","PUNITAQUI","PUNTA ARENAS","PUQUELDON","PUREN","PURRANQUE","PUTAENDO","PUTRE","PUYEHUE","QUEILEN","QUELLON","QUEMCHI","QUILACO","QUILICURA","QUILLECO","QUILLON","QUILLOTA","QUILPUE","QUINCHAO","QUINTA DE TILCOCO","QUINTA NORMAL","QUINTERO","QUIRIHUE","RANCAGUA","RANQUIL","RAUCO","RECOLETA","RENAICO","RENCA","RENGO","REQUINOA","RETIRO","RINCONADA","RIO BUENO","RIO CLARO","RIO HURTADO","RIO IBAÑEZ","RIO NEGRO","RIO VERDE","ROMERAL","SAAVEDRA","SAGRADA FAMILIA","SALAMANCA","SAN ANTONIO","SAN BERNARDO","SAN CARLOS","SAN CLEMENTE","SAN ESTEBAN","SAN FABIAN","SAN FELIPE","SAN FERNANDO","SAN GREGORIO","SAN IGNACIO","SAN JAVIER","SAN JOAQUIN","SAN JOSE DE MAIPO","SAN JUAN DE LA COSTA","SAN MIGUEL","SAN NICOLAS","SAN PABLO","SAN PEDRO","SAN PEDRO DE ATACAMA","SAN PEDRO DE LA PAZ","SAN RAFAEL","SAN RAMON","SAN ROSENDO","SAN VICENTE","SANTA BARBARA","SANTA CRUZ","SANTA JUANA","SANTA MARIA","SANTIAGO","SANTO DOMINGO","SIERRA GORDA","TALAGANTE","TALCA","TALCAHUANO","TALTAL","TEMUCO","TENO","TEODORO SCHMIDT","TIERRA AMARILLA","TILTIL","TIRUA","TOCOPILLA","TOLTEN","TOME","TORTEL","TRAIGUEN","TREGUACO","TUCAPEL","VALDIVIA","VALLENAR","VALPARAISO","VICHUQUEN","VICTORIA","VICUÑA","VIÑA DEL MAR","VILCUN","VILLA ALEGRE","VILLA ALEMANA","VILLARRICA","VITACURA","YERBAS BUENAS","YUMBEL","YUNGAY","ZAPALLAR"]
[null,null,null,null,null,null,null,null,null,null,null,null,null,null,"adulto",{"$f":"dvrut(I9)","v":0},{"$f":"IF(OR(ISBLANK(I9),ISBLANK(J9)),2,IF(P2=J9,1,0))","v":2},null,null,"AISEN",null,"ESCUELA ALMIRANTE SIMPSON","COLEGIO CARLOS ALESSANDRI ALTAMIRANO","ESCUELA BARRANCAS DE PICHI","ESCUELA BASICA PITRIL","EDUCADOR ARTURO ALVEAR RAMOS","COLEGIO SIMON BOLIVAR","ESCUELA ANEXA","COLEGIO NUESTRA SEÑORA DEL ROSARIO","COLEGIO MAR-A SYLVESTER RASCH","ESCUELA ALCALDE MAXIMILIANO POBLETE","ESCUELA OLGA RIOS DE PINOCHET","ESCUELA BÁSICA DE CARAMPANGUE","COLEGIO CENTENARIO DE ARICA","COLEGIO DE MAIPO","ESCUELA BASICA EDUARDO FREI MONTALBA","ESCUELA BASICA G-45","LICEO DONALD MC-INTYRE GRIFFITHS","ESCUELA ALTO CABRERO","ESCUELA ARTURO PRAT CHACON","ESCUELA BASICA SENORA DE LA CANDELARIA","ESCUELA EULOGIO GOYCOLEA GARAY","BYRON GIGOUX JAMES","COMPLEJO EDUCACIONAL LAS ACACIAS DE ARTIFICIO","ESCUELA BASICA F-N¦798 CALERA DE TANGO","ESCUELA BASICA CRISTO REDENTOR","ESC.BASICA CARLOS VIAL ESPANTOSO","ESCUELA BASICA KIM RUKA","ESCUELA BASICA SAN FRANCISCO","ESCUELA ARTURO ECHAZARRETA LARRAIN","ESCUELA AYTUE","ESCUELA BASICA EL NILHUE","COLEGIO BLANCO ENCALADA","EJERCITO LIBERTADOR DE CERRILLOS","COLEGIO NEPTUNO","ESC. BAS. DIFERENCIAL JOSE LUIS OLIVARES A.","ESCUELA BASICA ALMIRANTE JUAN JOSE LATORRE","ESCUELA ESPECIAL DE LENGUAJE POLHUIN","CENTRO DE RECURSOS EDUCATIVO INTEGRARTE","ESCUELA BALMACEDA SAAVEDRA L.","ESC. LIBERTADOR BERNARDO O¦HIGGINS RIQUELME","ESC. BASICA ARTURO MUTIZABAL SOTOMAYOR","ESCUELA BASICA LOS COLIGUES","CENTRO PARVULARIO DE CHIMBARONGO","ESC. BASICA EL PROGRESO","ESCUELA BASICA SAN CARLOS DE CHONCHI","ESCUELA EUSEBIO IBAR SCHEPELER","ESCUELA BASICA BUCHUPUREO","ESCUELA BASICA FRONTERIZA JUAN SOLER MANFREDINI","ESC. BASICA HERNAN MERINO CORREA","COLEGIO JESUS ANDINO","ESCUELA CLEMENTINA MAUREIRA ALMANZA","ESCUELA BAQUEDANO","ESCUELA BASICA NIBLINTO","COLEGIO MUNICIPAL HUALLILEN","ESCUELA ANDRES BELLO","LICEO TECNICO PROFESIONAL COLCHANE","ANDALIEN DE COLINA","ESCUELA BASICA MIGUEL HUENTELEN","COLEGIO NUESTRA SEÑORA DE LORETO","ESCUELA BASICA AMERICA","COLEGIO BICENTENARIO REP+BLICA DEL BRASIL","CENTRO EDUC. POETA EUSEBIO LILLO","ESCUELA BASICA IRMA SALAS SILVA","ESCUELA CHACARILLAS","ESCUELA CALEBU","COLEGIO BUEN PASTOR","COLEGIO LA HERRADURA","ESCUELA ADELAIDA MIGUIELES SOTO","ESCUELA BASICA DE CORRAL","ESCUELA AURORA DE CHILE","ESCUELA BASICA REPUBLICA DE MEXICO","ESCUELA BAS. MUNIC. CUYUNCAVI","ESCUELA RURAL EDUARDO FREI MONTALVA","ESCUELA BUENA ESPERANZA","COMPLEJO EDUCACIONAL MONSEÑOR FRCO. VALDES S","ESCUELA ELENA ARMIJO MORALES","COLEGIO ALESSANDRI","ESCUELA BASICA DALCAHUE","ESCUELA ALIRO LAMAS CASTILLO","ESCUELA BULI-CASERIO","COLEGIO JULIO SILVA LAZO","COMPL.EDUCACIONAL BRIGIDA WALKER ANEXO","COLEGIO BATALLA DE LA CONCEPCION","ESCUELA BERNARDINO MUNOZ GONZALEZ","ESC. BASICA JAVIERA CARRERA VERDUGO","COMPLEJO EDUCACIONAL CLARA SOLOVERA","COLEGIO EL TABO","LICEO SAN IGNACIO","ESCUELA BASICA SALVADOR ALLENDE","CENTRO EDUC.MUNIC. DR. AMADOR NECHME R.","ESCUELA BASICA PUENTE SIETE","ESCUELA ALLIPEN","ESCUELA BASICA ALEJANDRO NOEMI HUERTA","ESCUELA BASICA FRESIA","ESCUELA ARTURO ALESSANDRI PALMA","ESCUELA FUTALEUFU","ESCUELA BASICA JOSE M. BALMACEDA F.","ESC. BASICA FORTIN NIELOL","ESC.PRESBITERO JOSE AGUSTIN GOMEZ Z.","COLEGIO ANTONIO TRDAN ARKO","LICEO MELINKA","ESCUELA ADRIANA RIQUELME NUNEZ","ESC. MONSENOR MANUEL LARRAIN ERRAZURIZ","COLEGIO MAURICIO HITCHCOCK","COLEGIO BASICO VILLA ACERO","ESCUELA ALEJANDRO VARELA SANTA MARIA","ESCUELA PISAGUA","ESCUELA BASICA JOSE MIGUEL CARRERA","ESCUELA ADELAIDA LA FETRA","ESCUELA BASICA CAMILO HENRIQUEZ","ESCUELA DE PARVULOS ANTU-HUILEN","COLEGIO ESPANA","CENTRO DE EDUCACION MARIO BERTERO CEVASCO","COLEGIO BASICO LORENZO BAEZA VEGA","COLEGIO INSULAR ROBINSON CRUSOE","COLEGIO ANTU","COLEGIO BOLONIA","ESCUELA PROF. MONICA SILVA GOMEZ","COLEGIO ARTISTICO SOL DEL ILLIMANI","COLEGIO MUNICIPAL PROCERES DE CHILE","ESCUELA BASICA CARLOS CONDELL","COLEGIO LUIS CRUZ MARTINEZ","COLEGIO NERUDA","COLEGIO MUNICIPALIZADO CONFEDERAC SUIZA","COLEGIO ALTOVALSOL","COLEGIO DE CULTURA Y DIFUSION ARTISTICA","COMPLEJO EDUCACIONAL IGNAO","ESCUELA AMANDA LABARCA","ESCUELA BASICA CACIQUE COLIN","ESCUELA ALBERTO CORDOVA LATORRE","COLEGIO INES DE SUAREZ","COLEGIO LEONARDO DA VINCI DE LAS CONDES","ESC. BASICA AMELIA GODOY","ESCUELA ARTURO EBENSPERGER RICHTER","COLEGIO DR. MANUEL AVILES INOSTROZA","ESCUELA BASICA BRASILIA","ESCUELA ALEJANDRO GIDI","ESCUELA CARDENAL RAUL SILVA HENRIQUEZ","ESCUELA AGUSTIN EDWARDS","ESCUELA BASICA GABRIELA MISTRAL","ESCUELA DE ED.DIFERENCIAL LO BARNECHEA","COLEGIO HERNAN OLGUIN","COMPLEJO EDUCACIONAL PEDRO PRADO","ESCUELA BASICA GALVARINO VALENZUELA MORAGA","ESCUELA ALBORADA","ESCUELA ANGEL CRUCHAGA SANTA MARIA","ESCUELA BÁSICA BERNARDO ÑANKO","ESCUELA CLAUDIO FLORES SOTO","ESCUELA BASICA GRAL.JOSE MIGUEL CARRERA","ESCUELA ARTURO ALESSANDRI PALMA","ESCUELA FRANCIA","COLEGIO DE DIFUSION ARTISTICA LOS ULMOS","ESCUELA BASICA VILLA TRINTE","COLEGIO DIEGO DE ALMAGRO","COLEGIO ANGEL DE PEREDO","ESCUELA BASICA REPUBLICA DE ITALIA","COLEGIO BELLAVISTA","ESCUELA BAS. CENTRO EDUCACIONAL MILLANTU","ESCUELA ALABAMA","COLEGIO ALCAZAR","ESC.ALCIDES REYES FRIAS","ESCUELA MUNICIPAL AMERICA","ESCUELA ARTURO PEREZ CANTO","ESCUELA BASICA F-N¦ 732 CHOROMBO ALTO","COLEGIO SAN JOSE","ESCUELA CALLEJONES","ESCUELA ENCARNACION OLIVARES","ESCUELA BASICA JULIA HERRERA VARAS","ESCUELA BASICA VOLCAN LLAIMA","COLEGIO HUILCO ALTO","ESC.INTERN.LAS PALMAS TRES ESQUINAS","COLEGIO BASICO RENACER DE CERRILLOS","COLEGIO ANDRES BELLO","ESCUELA BASICA MULCHEN","ESCUELA BASICA DOLLINCO","COLEGIO BASICO CONSOLIDADO","ESC. DE CONCENTRACION FRONTERIZA DOROTEA","COLEGIO MUNICIPAL DIVINA GABRIELA","ESCUELA BASICA RIHUE","ESCUELA BASICA EL RINCON","ESCUELA BASICA EL MELON","ESC. BASICA CHIVILCOYAN","ESCUELA PIONEROS DEL SUR","COL.MARIA VILLALOBOS ARTEAGA","ESCUELA ATENAS","ESCUELA CARLOS CONDELL","COLEGIO DE ADMINISTRACION Y COMERCIO EL INGENIO","ESCUELA CRISTAL CHILE","ESCUELA CHAPOD","ESCUELA GABRIELA MISTRAL","ESCUELA NUEVA AURORA","COLEGIO CHALLAY","ESCUELA ROBERTO WHITE GESELL","ESCUELA JORGE ERRAZURIZ ECHEÑIQUE","CENTRO EDUCATIVO FERNANDO SANTIVAN","ESCUELA BASICA FRAY CAMILO HENRIQUEZ","ESCUELA PAPUDO","ESC.BASICA MERCEDES URZUA DIAZ","ESCUELA ARMANDO GUZMAN MORALES","ESCUELA BASICA G-N¦673 PELVIN SAN FRANCISCO DE ASIS","CENTRO EDUC. VALLE HERMOSO","COLEGIO PARQUE LAS AMERICAS","ESCUELA EL MANZANO","ESCUELA BENITO MANCILLA PEREZ","ESCUELA ARTURO MATTE ALESSANDRI","COMPLEJO EDUCACIONAL PENCAHUE","ESCUELA ALMIRANTE JORGE MONTT -LVAREZ","COLEGIO BASICO VIOLETA PARRA SANDOVAL","ESCUELA EDUARDO FREI MONTALVA","ESCUELA BASICA LOS ALAMOS EL SOBRANTE","ESCUELA BASICA ANTONIO DE ZUNIGA","ESC. MATILLA DE NUEVA EXTREMADURA","ESCUELA AMELIA LYNCH DE LYON","COLEGIO LIBERTADORES","ESCUELA BASICA JUAN JORGE","ESCUELA BASICA G-841 SANTOS RUBIO MORALES","ESCUELA JUAN BTA. CHESTA CH.","ESCUELA BASICA RAUL CACERES PACHECO","ESCUELA LOMAS DE CHUDAL","ESCUELA LIBERTADOR BDO. O¦HIGGINS R.","ESCUELA BASICA FUERTE BAQUEDANO","ESCUELA CERRO SOMBRERO","ESC. DE PARV. MADRE BERNARDA MORIN DE PROVIDE","COLEGIO GENERAL JOSE VELASQUEZ BORQUEZ","ESC. BASICA CARILEUFU","COLEGIO FINLANDIA","CENTRO EDUCACIONAL NUEVA CREACION","COLEGIO DARIO SALAS","ESCUELA ALBERTO HURTADO","COLEGIO MIRADOR DEL LAGO","ESCUELA MUNICIPAL DE NILAHUE CORNEJO","ESCUELA BELGICA","ESC. CAPITAN ARTURO PRAT CHACON","ESCUELA PUQUELDON","ESC. BASICA CAUPOLICAN","COLEGIO CRECER","CTRO.APOYO A LA EDUC.ESPEC.DE PUTAENDO","LICEO GRANADEROS","ESCUELA ENTRE LAGOS","ESCUELA CHILHUE","ESCUELA ALLA-KINTUY","ESCUELA BASICA MIL PAISAJES-QUEMCHI","ESCUELA BASICA LONCOPANGUE","ESC. BAS.MUNICIPAL MERCEDES FONTECILLA","ESCUELA BASICA VILLA MERCEDES","ESCUELA BÁSICA AMANDA CH-VEZ NAVARRETE","COLEGIO VALLE DE QUILLOTA","COLEGIO CAPITAN IGNACIO CARRERA PINTO","ESCUELA RURAL LOS PINOS","COLEGIO RA+L RAM-REZ MAYOL","ESCUELA ABATE MOLINA","COLEGIO COSTA MAUCO","ESCUELA EL LLANO","COL. JOSE A. MANSO DE VELASCO Y S.","ESCUELA BASICA AMERICA","ESCUELA EL PLUMERO","CENTRO EDUC.ESCRITORES DE CHILE","ESCUELA BASICA LOS NOGALES","ESC. BASICA MONSERRAT ROBERT DE GARCIA","COLEGIO MANUEL FRANCISCO CORREA","COL.EDUC. ESPECIAL DR. ALBERT SCHWEITZER","COLEGIO AJIAL","ESCUELA BASICA EMIGDIO GALDAMES ROBLES","ESCUELA BASICA PATRICIO LYNCH","ESCUELA BASICA JUAN LUIS SANFUENTES ANDONAEGUI","COLEGIO PICHASCA","ESCUELA AONIKENK","COLEGIO RIACHUELO","BERNARDO DE BRUYNE","ESCUELA AMERICA LATINA","ESC. BASICA ANTONIO LADINO","ESC.DE EDUC.GRAL. BASICA MONSENOR ENRIQUE COR","ESCUELA BASICA BERTA HIDALGO BARAHONA","COLEGIO ESPANA","CENTRO EDUC. PADRE ALBERTO HURTADO DE SAN BER","ESCUELA AGUA BUENA","ESCUELA AURORA","ESC. BASICA SILVIO ZENTENO VERGARA","ESCUELA BASICA PASO ANCHO","ESCUELA 21 DE MAYO","COLEGIO GIUSEPPE BERTOLUZZI DE FELIP","ESCUELA PUNTA DELGADA","COLEGIO POLITECNICO VICTOR JARA","ESCUELA BERNARDO OHIGGINS","CENTRO EDUC. PROVINCIA DE ÑUBLE","ESCUELA BASICA F-N¦629 DE CONCENTRACION FRONTERIZA","ESCUELA RURAL PUAUCHO","ESCUELA BASICA MUNICIPAL","ESCUELA BASICA EL PEUMO","ESCUEAL RURAL QUILEN","ESCUELA BASICA G-N¦126","COMPLEJO EDUCACIONAL TOCONAO","BASICA SARGENTO CANDELARIA PEREZ","ESCUELA ALTO PANGUE","ESCUELA BASICA ALIVEN","LICEO ISIDORA AGUIRRE TUPPER","CENTRO EDUC. REQUEGUA","ESCUELA BÁSICA CACIQUE LEVI-N","ESC. MUNICIPAL LA LAJUELA","ESCUELA CHACAYAL","ESCUELA BASICA AURORA VELASCO PEREZ","CIUDAD SANTIAGO DE CHILE","COLEGIO PEOPLE HELP PEOPLE","ESCUELA CARACOLES","ESCUELA ALBORADA DE TALAGANTE","ESCUELA ANTUPEHUEN","ARTURO PRAT CHACON","ESCUELA ALONDRA ROJAS BARRIOS","COLEGIO MUNDO MAGICO","ESC. MANUEL RODRIGUEZ ERDOIZA","ESCUELA HORIZONTES","ESC. BASICA MARTA EMILIANA AGUILAR ZERON","ESCUELA BASICA G-N¦ 346","ESCUELA ANA MOLINA","ESCUELA ARTURO PRAT CHACON","ESCUELA AGUAS Y GAVIOTAS","ESCUELA BÁSICA LISA ENRIQUETA PETER TEUBNER","ESCUELA MUNICIPAL CDTE LUIS BRAVO BRAVO","ESCUELA BASICA EMILIA ROMAGNA","ESCUELA BÁSICA VALLE LONQU+N","ESCUELA ALEJANDRO PEREZ URBANO","COLEGIO DEPORTIVO MUNICIPAL DE VALDIVIA","ESC.BASICA CAPITAN RAFAEL TORREBLANCA","CENTRO EDUCATIVO FLORIDA","ESCUELA EMA CORNEJO DE CARDOEN","COLEGIO IGNACIO CARRERA PINTO","COLEGIO JOAQUIN VICUÑA LARRAIN","COLEGIO MIRAFLORES","COLEGIO AMERICA","ESCUELA ALCALDE MANUEL SALVADOR DEL C.","COLEGIO CHARLES DARWIN","ESCUELA ALEXANDER GRAHAM BELL","COLEGIO ANTARTICA CHILENA","ESCUELA JORGE SALGADO PICA","ESCUELA DIEGO PORTALES PALAZUELOS","ESCUELA BASICA RANCHILLOS","ESCUELA BASICA MERCEDES MATURANA GALLARDO"]
[null,null,null,null,null,"Comuna",null,null,null,{"$f":"VLOOKUP(G3,Hoja4!$D$2:$F$2763,3,FALSE)","v":{"$error":"#N/A"}},null,null,null,null,null,null,null,null,null,"ALGARROBO",null,"ESCUELA AYSEN","ESCUELA BASICA RURAL EL YECO","ESCUELA EL ASIENTO","ESCUELA CALLAQUI","ESCUELA FRONTERIZA","ESC ESP DE LENGUAJE OASIS DEL SABER","ESCUELA FATIMA","ESCUELA LUIS CRUZ MARTINEZ","ESC. BASICA MANUEL RODRIGUEZ","ESCUELA ARMANDO CARRERA GONZALEZ","ESCUELA VOLCAN ANTUCO","ESCUELA BÁSICA MARE NOSTRUM","COLEGIO INTEGRADO EDUARDO FREI MONTALVA","ESCUELA BASICA G-N¦813 LOS AROMOS DE EL RECURSO","ESCUELA BASICA PUEBLO SECO SANTA CLARA","ESCUELA BASICA LA VINA",null,"ESCUELA BASICA ENRIQUE ZANARTU PRIETO","ESCUELA BÁSICA HOMERO VIGUERAS ARANEDA","ESCUELA DE PARVULOS INTI PANNI","ESCUELA JOSE MANUEL BALMACEDA","ESCUELA MANUEL ORELLA ECHANEZ","ESCUELA BASICA EL LIBERTADOR","LICEO LONQUEN","ESCUELA BASICA LA PAMPILLA","ESCUELA BASICA CANELA ALTA","ESCUELA BASICA NEHUENTUE","ESCUELA CARMEN ROMERO AGUIRRE","ESCUELA BASICA LAGUNILLAS","ESCUELA DIFERENCIAL `ANTU- KAU`","ESCUELA BASICA LOS CERRILLOS","ESCUELA ADOLFO QUIROZ HERNANDEZ","ESCUELA BASICA PEDRO AGUIRRE CERDA","COMPLEJO EDUCACIONAL CERRO NAVIA","ESCUELA BASICA ANGELINA SALAS OLIVARES","ESCUELA RURAL AYACARA","ESCUELA LOANCO","COLEGIO LIBERTADOR O¦HIGGINS DE CHEPICA","ESCUELA BASICA JOHN F. KENNEDY","ESCUELA BASICA DE CHILE CHICO","ESCUELA 27 DE ABRIL","ESCUELA BASICA NEBUCO","ESCUELA BAS. JOSE MIGUEL CARRERA VERDUGO","ESCUELA BASICA COIHUE CURACO","ESCUELA DE EDUCACION ESPECIAL AMANECER","ESCUELA GUIDO GOMEZ MUNOZ","ESCUELA REINO DE SUECIA","ESCUELA RURAL RIO PUELO",null,"COLEGIO MARIANO LATORRE","ESCUELA FELIPE CUBILLOS SIGAL","ESCUELA JOSE ANTOLIN SILVA ORMENO","ESCUELA BRITANICA GUILLERMINA DRAKE WOOD","ESCUELA MUNICIPAL CHILLEHUE","ESCUELA BASICA DE COLBUN",null,"ESC. ESPECIAL ELSA MATILDE ULRICH JARA","ESCUELA BASICA VICTOR DURAN PEREZ","COLEGIO QUILLAYQUEN RINCONADA DE PARRAL","ESCUELA BASICA ARTURO PEREZ CANTO","COLEGIO BIOBÍO","ESCUELA ALLIPEN","ESCUELA BASICA PUENTE COLMO","ESCUELA COSTA BLANCA","ESCUELA SAN LUIS DE CONTULMO","ESC.EDUC.DIFERENCIAL MARIA LUZ LANZA PIZARRO","COLEGIO PABLO NERUDA","ESCUELA AMBROSIO O¦HIGGINS","ESCUELA RURAL CHAIHUIN","ESCUELA BASICA LAS HORTENCIAS","ESCUELA LUIS CRUZ MARTINEZ","ESCUELA BASICA VALLE DE PUANGUE","ESCUELA RURAL HUYAR ALTO","ESCUELA COLICO NORTE","ESCUELA EL SANTILLO","ESCUELA FRAY PEDRO ARMENGOL VALENZUELA","COLEGIO EL BOLDO","ESCUELA RURAL JUAN VICTORINO TANGOL","ESCUELA BASICA SARA CORTES CORTES","ESCUELA CHACAY","COLEGIO MUNICIPAL LA ISLA","ESC.PRESIDENTE EDUARDO FREI MONTALVA","COMPLEJO EDUCACIONAL FELIPE HERRERA LANE","ESCUELA DE SAN VICENTE ALTO","ESCUELA CHINIGUE EL CRISTO","ESCUELA EL TOTORAL","ESCUELA BASICA LAS CRUCES",null,"ESCUELA BASICA TEMOCUICUI","ESCUELA ARNALDO FALABELLA","ESCUELA BASICA VILLAMAVIDA","ESCUELA ARMANDO QUINTULEN","ESCUELA DE MAITENCILLO","ESCUELA RURAL SAN ANDRES","ESCUELA BERNARDO PHILIPPI",null,"ESCUELA DE PARVULOS LOS PUMITAS","ESCUELA BASICA DE EL CAPRICHO","ESCUELA BASICA CINCO","COLEGIO MAR-A ESCOBILLANA GUZM-N",null,"ESCUELA ANA JESUS IBACACHE","ESCUELA AMELIA VIAL DE CONCHA","ESCUELA ANTUPIREN","ESCUELA ALONKURA","ESCUELA BASICA LOS LIBERTADORES","LICEO DE HUARA","ESCUELA EL OLIVAR","ESCUELA BÁSICA N¦2442 `CENTRO EDUCACIONAL ERNESTO YAÑEZ RIVERA`","ESCUELA BASICA CLEMENCIA VILLARROEL","ESCUELA LUIS GALDAMES","COLEGIO REPUBLICA DE CROACIA","ESC.BASICA SAN ANTONIO DE NALTAGUA",null,null,"COLEGIO NACIONES UNIDAS","COLEGIO DOMINGO SANTA CRUZ WILSON",null,"COLEGIO CAPITAN PASTENE","ESCUELA BAS. BENJAMIN SUBERCASEAUX","ESCUELA BASICA PEDRO PABLO MUNOZ","ESCUELA COMUNIDADES DE VALLE HERMOSO","COLEGIO SIMON BOLIVAR","COLEGIO SAN CONSTANTINO","COLEGIO ARTURO PRAT CHACON","ESC.DIFERENC.VILLA SAN JOSE DE LA UNION","ESCUELA RURAL RININAHUE","ESCUELA ANDRES ALCAZAR","ESCUELA BASICA F - N¦372 SANTA SARA","ESCUELA FELIPE BARTHOU CORBEAUX","ESC. CONTRAMAESTRE CONSTANTINO MICALVI","COLEGIO SAN FRANCISCO DEL ALBA","ESC. BASICA GUACOLDA","ESCUELA BOCA LEBU","ESCUELA ALEJANDRO ROJAS SIERRA","ESCUELA BASICA HEROES DE CHILE","ESCUELA BASICA ESPANA","ESCUELA MUNICIPAL PULIN","ESCUELA BASICA EL PORVENIR","ESCUELA INES GALLARDO ALVARADO","ESCUELA DE FARELLONES","ESCUELA BASICA","ESC.DE EDUCACION DIFERENCIAL QUILLAHUE","ESCUELA OCTAVIO MUJICA VALENZUELA","ESCUELA ARAUCARIAS","ESCUELA ANSELMO DEL CARMEN TAPIA LOYOLA","ESCUELA BASICA MALALMAHUIDA","ESCUELA FELIX EYHERAMENDY","ESCUELA BASICA RIO BLANCO","ESCUELA BÁSICA ESPERANZA","ESCUELA NEVADA","COLEGIO INGL+S MABEL CONDEMAR-N","ESCUELA GUSTAVO VASQUEZ DIAZ","ESCUELA BASICA ERCOLE BENCINI","ESCUELA BÁSICA CARABINERO ISA-AS GUEVARA","ESCUELA F-174 VALLE DE LUMACO","COLEGIO GABRIELA MISTRAL","ESCUELA BASICA","LICEO GABRIELA MISTRAL","COLEGIO MUNIC. SAN SEBASTIAN DE RINCONADA","ESCUELA MUNICIPAL DE CORCOLEN","ESCUELA MUNICIPAL PAILIMO",null,"ESCUELA BASICA F-N¦738 LOS RULOS","ESC.RURAL JUAN POBLETE SAINT-SIMON","ESCUELA CHACARILLA","ESCUELA JOSE ABELARDO NUÑEZ",null,null,"COLEGIO LOS JAZMINES","ESCUELA BAJO LOS ROMEROS","COLEGIO RIO GRANDE","COLEGIO DEL CAMINO REAL","ESCUELA BASICA VILLA LAS PENAS","ESCUELA CANADA","ESCUELA BÁSICA PUQUILLAY","ESCUELA BAUDILIA AVENDANO DE YOUSSUF","ESCUELA BASICA CONFEDERACION HELVETICA","ESCUELA BASICA VAQUERIA","ESCUELA BASICA TALHUAN","ESCUELA BASICA LA PENA","ESC. BASICA LA ARAUCARIA",null,"ESCUELA MUNICIPAL DE GULTRO","ESCUELA BÁSICA QUEBRADA DE ALVARADO","ESCUELA CLAUDIO ARRAU","COLEGIO DE ARTES ELISEO VIDELA JORQUERA","ESCUELA LA ESPERANZA","ESCUELA CHOMIO","ESCUELA JERONIMO GODOY VILLANUEVA","ESCUELA OLEGARIO MORALES OLIVA","ESC. BASICA MUNICIPAL PAULA JARAQUEMADA ALQUI",null,"ESCUELA MUNICIPAL DE PALMILLA","COMPLEJO EDUCACIONAL TIERRA DE ESPERANZA","ESCUELA BASICA VINA ERRAZURIZ","ESCUELA RURAL PULLALLY","ESCUELA MUNICIPAL ALBERTINA VALENZUELA","ESCUELA ARRAU MENDEZ","ESCUELA DIFERENCIAL ALEGRIA DE VIVIR","CENTRO EDUCACION MARIANO EGANA","ESC. BASICA MUNICIPAL RISOPATRON","ESCUELA HERNAN CIUDAD INOSTROZA","ESCUELA GLADYS CANALES PAREDES","ESCUELA BASICA GENERAL CRUZ","ESCUELA CORINTO","ESCUELA ALMIRANTE PATRICIO LYNCH","COLEGIO MANUEL RODRIGUEZ ERDOIZA",null,"ESCUELA BASICA PEDEGUA","ESCUELA BASICA ROSARIO DE CODAO","ESCUELA SAN ANDRES DE PICA","ESCUELA BASICA JOSE BERNALES CASTILLO","ESCUELA DIGNA CAMILO","ESCUELA HECTOR MANUEL ARIAS CORTES","ESCUELA BASICA G-N¦643 SAN JUAN DE PIRQUE","ESCUELA LAS AMERICAS","ESCUELA DANY GERMAN GONZALEZ SOTO","LICEO NIBALDO SEPULVEDA FERNANDEZ",null,"ESCUELA BASICA LA HUAYCA",null,"ESCUELA ABELARDO ITURRIAGA JAMETT","COMPLEJO EDUCACIONAL SARGENTO ALDEA","ESC.BASICA PAILLACO","ESC.COMODORO ARTURO MERINO BENITEZ","ESCUELA ANDES DEL SUR","COLEGIO LOS ALERCES","ESCUELA RURAL ADMINISTRACION RUPANCO","COLEGIO NUEVA BRAUNAU","ESCUELA MUNICIPAL DE PUMANQUE","ESCUELA TERESITA DE LOS ANDES","ESCUELA DE PUERTO HARRIS","ESCUELA RURAL DETIF","ESCUELA ENZO FERRARI","ESCUELA BERTOLDO HOFMANN KAHLER","ESC. BAS. GASTON ORMAZABAL CABRERA",null,"ESCUELA PARVULARIA `RAYITO DE SOL`","ESCUELA RURAL ALVARO VARGAS MIRANDA","ESCUELA BASICA SECTOR ORIENTE","ESCUELA RURAL AQUELARRE","INSTITUTO VALLE DEL SOL QUILACO","ESCUELA BASICA ANA FRANK","LICEO FRANCISCO BASCUNAN GUERRERO","ESCUELA BÁSICA LAGUNA AVENDAÑO","ESCUELA BASICA ABEL GUERRERO AGUIRRE","COLEGIO FERNANDO DURAN VILLARREAL","ESCUELA RURAL METAHUE","ESCUELA AMPARO RAYO HORTA","ESCUELA ANGELMO","COLEGIO VALLE DE NARAU","ESCUELA GRUMETE CORTES","COLEGIO AURORA DE CHILE","ESCUELA BASICA ÑIPAS","ESCUELA LOS ALMENDROS","ESC.BAS.BILINGUE REPUBLICA DEL PARAGUAY","ESCUELA MUNICIP. LA NOBEL GABRIELA","ESC.MUNIC.DE PARVULOS HERNAN DEL SOL","COLEGIO MUNICIPAL DE APALTA","ESC. REPUBLICA DE FRANCIA","COLEGIO ROBINSON CABRERA BELTRAN","ESCUELA BASICA MANUEL LEON SALINAS","ESCUELA BASICA RIO BUENO","ESCUELA ODESSA","ESCUELA BASICA DE SERON",null,"ESCUELA ANDREW JACKSON",null,"ESCUELA ARTURO ALESSANDRI PALMA","ESC. BASICA AUGUSTO WINTER TAPIA","ESCUELA EUGENIO TAGLE VALDES","ESCUELA BASICA CHILLEPIN","EDUARDO FERNANDEZ DE ASTURIAS","CENTRO EDUCACIONAL BALDOMERO LILLO","ESCUELA BULI","ESCUELA BAJO LIRCAY","ESCUELA BÁSICA LIBERTAD","LICEO JORGE ALESSANDRI RODRIGUEZ","ESCUELA ALMENDRAL","COLEGIO HERMANO FERNANDO DE LA FUENTE",null,"ESCUELA BASICA PUEBLO SECO","ESCUELA GERONIMO LAGOS LISBOA","CENTRO EDUCACIONAL HORACIO ARAVENA A.","ESCUELA BASICA F-N¦632 EL CANELO",null,"ESCUELA ESPECIAL LOS CEDROS DEL LIBANO","ESCUELA BASICA LA LOMA","ESCUELA BASICA SAN PABLO","ESCUELA BASICA G-N¦128 ATALICIO AGUILAR A.","ESCUELA BASICA SAN BARTOLOME","COLEGIO GALVARINO DE LOMAS COLORADAS","ESCUELA EL MILAGRO","ESCUELA BASICA EDUCADORES DE CHILE",null,"ESC. ADRIANA ARANGUIZ CERDA","ESCUELA BÁSICA ENRIQUE BERNSTEIN CARABANTES","ESCUELA ANGEL ARRIGORRIAGA","ESCUELA DIEGO PORTALES","ESCUELA GUILLERMO BANADOS HONORATO","ESC. BAS. REPUBLICA ORIENTAL DE URUGUAY","ESCUELA BASICA CLAUDIO VICUNA","ESCUELA ESTACION BAQUEDANO","ESCUELA BASICA TEGUALDA","ESCUELA AURORA DE CHILE","COLEGIO BASICO LOS LOBOS","ESCUELA HOGAR VICTORIANO QUINTEROS SOTO","COMPLEJO EDUC. UN AMANECER EN LA ARAUCANIA","ESCUELA ALBORADA VENTANA DEL BAJO","ESCUELA NUEVA ALBORADA","ESCUELA AMOLANAS","ESCUELA BASICA G-N¦345 RUNGUE","ESCUELA CASA DE PIEDRA","ESCUELA CARLOS CONDELL DE LA HAZA","ESCUELA AMANECER DE VILLA LOS BOLDOS","ESCUELA BÁSICA REP+BLICA DE ECUADOR",null,"ESCUELA DIEGO PORTALES","ESCUELA ESPECIAL DE LENGUAJE SONRISAS","ESCUELA BASICA TUCAPEL","COLEGIO TENIENTE HERNAN MERINO CORREA","ESCUELA ARTURO PEREZ CANTO","COLEGIO PABLO NERUDA","ESCUELA ENTRE AGUAS DE LLICO","ESCUELA BASICA PATRICIO LINCH","ESCUELA AMELIA BARAHONA MUJICA","COLEGIO REPUBLICA DE COLOMBIA","COMPLEJO EDUCACIONAL LA GRANJA","ESCUELA ALCALDE ORLANDO RODRIGUEZ DEL C.","COLEGIO ITALO COMPOSTO SCARPATI","ESCUELA EPUKLEI","LICEO MUNICIPALIZADO AMANDA LABARCA","ESCUELA LUIS AMBROSIO CONCHA","ESCUELA ENRIQUE PUFFE KIND","ESCUELA FERNANDO BAQUEDANO","LICEO DE ZAPALLAR"]
[null,null,null,null,null,"Establecimiento",null,null,null,{"$f":"VLOOKUP(G4,Hoja4!$C$2:$E$2763,3,FALSE)","v":{"$error":"#N/A"}},null,null,null,null,null,0,null,"Padre",null,"ALHUE",null,"ESCUELA BASICA","ESCUELA DE PARVULOS LOS CLAVELES","ESCUELA HACIENDA ALHUE","ESCUELA DE CONCENTRACIÓN FRONTERIZA RALCO ALTO BIOBÍO","ESCUELA RICARDO CAMPILLAY CONTRERAS",null,"ESCUELA PUDETO","ESCUELA PATRICIO LYNCH","ESCUELA BASICA ARAGON","ESCUELA ARTURO PRAT","LICEO DOCTOR V-CTOR R-OS RUIZ","ESCUELA BASICA BRISAS DEL MAR","ESC. COMTE. JUAN JOSE SAN MARTIN","ESCUELA HUMBERTO MORENO RAMIREZ","ESCUELA BATALLA DEL ROBLE","ESCUELA BASICA MUNICIPAL ARAUCARIA",null,"ESCUELA CHARRUA","ESCUELA BASICA CACIQUE FRANCISCO MELIN","ESCUELA DE PARVULOS LAS ABEJITAS","ESCUELA LIBERTADOR GENERAL BERNARDO O¦HIGGINS RIQUELME","ESCUELA VILLA LAS PLAYAS","ESCUELA BASICA GABRIELA MISTRAL","LICEO MUNICIPAL POETISA GABRIELA MISTRAL","ESCUELA BASICA MARIA ISABEL DE BROWN","ESCUELA BASICA JUAN ANTONIO RIOS","ESCUELA DARIO SALAS DIAZ","ESCUELA PRESIDENTE AGUIRRE CERDA","ESCUELA DOMINGO ORTIZ DE ROZAS","ESCUELA INES MUNOZ DE GARCIA","ESCUELA BASICA SANTA MARGARITA","ESCUELA ANIBAL PINTO","ESCUELA CERRILLOS","ESCUELA ALIANZA","ESCUELA BASICA DIEGO PORTALES PALAZUELOS",null,"ESCUELA LOS HEROES","ESCUELA LUIS ARTURO ZUNIGA FUENTES","ESCUELA BASICA MANQUIMAVIDA",null,"ESCUELA ANTONIO MACHADO","ESCUELA BASICA RUCAPEQUEN","ESCUELA BAS. PEDRO ETCHEVERRY","LICEO JAMES MUNDELL","LICEO MANUEL JESUS ANDRADE BORQUEZ","ESCUELA HAMBURGO",null,null,null,"COLEGIO MUNICIPAL CRISTO DEL PARQUE","ESCUELA GUARILIHUE ALTO","ESCUELA NIEVES DEL SUR","ESCUELA DOMITILA URREJOLA MENCHACA","ESCUELA MUNICIPAL COPEQUEN","ESCUELA CARLOS DEL CAMPO RIVERA",null,"ESC.BASICA FRANCISCO PETRINOVIC KARLOVAC","ESCUELA BENJAMIN FRANKLIN","ESC. LUCILA GODOY ALCAYAGA","ESCUELA BASICA JUANITA FERNANDEZ SOLAR","COLEGIO ESPAÑA","ESCUELA ARAUCARIAS DE CHILE","ESCUELA ORO NEGRO","ESCUELA ENRIQUE DONN MULLER",null,"ESCUELA ABRAHAM SEPULVEDA PIZARRO","COLEGIO SANTA CECILIA","ESCUELA ARTURO HUGHES CERNA",null,"ESCUELA BASICA QUECHEREHUE","ESCUELA OSVALDO FUENTES BARRERA","ESCUELA ELIECER PEREZ VARGAS","ESCUELA RURAL SAN JAVIER","ESCUELA COLICO SUR","ESCUELA JERONIMO NECULPAN","ESCUELA GASPAR HERRERA HERRERA","COLEGIO POLIVALENTE JAPÓN","ESCUELA RURAL MALLINLEMU",null,"ESCUELA COLVINDO","COLEGIO REPUBLICA DE CHILE","ESCUELA AURORA DE CHILE","ESC. BAS. PDTE. SALVADOR ALLENDE G.","ESCUELA DEL CARMEN SAN MART-N OT-ROLA","ESCUELA EL REMANSO","ESCUELA POETA NERUDA DE ISLA NEGRA",null,null,"ESCUELA BASICA TEODOCIO URRUTIA","ESCUELA BÁSICA ARTURO ALESSANDRI PALMA","ESCUELA RAHUIL","ESCUELA COIPUE","ESCUELA EMILIA SCHWABE RUMOHR",null,"ESCUELA CLAUDIO MATTE",null,"ESCUELA FRONTERIZA DE LLIFEN","ESCUELA BASICA DE LA PIEDRA","ESCUELA BASICA LICARAYEN","ESCUELA MUNICIPAL DE TUNICHE",null,"ESCUELA BASICA BENJAMIN MATTE LARRAIN","ESCUELA LA HUERTA DE MATAQUITO","ESCUELA RURAL CATARATAS DEL ALERCE","ESCUELA BÁSICA CRISTÓBAL COLÓN","ESCUELA CARLOS ALBERTO FERN-NDEZ CASTILLO",null,"ESCUELA MIREYA ZULETA ASTUDILLO","ESCUELA BASICA CARLOS PRATS G.","ESCUELA BASICA GRACIELA DIAZ ALLENDE","ESCUELA NUEVA ZELANDIA","COLEGIO REPUBLICA DE ITALIA","ESCUELA BASICA EFRAIN MALDONADO TORRES",null,null,"COLEGIO PALESTINO","COLEGIO LEONARDO DA VINCI",null,"COLEGIO MARIA ELENA","ESCUELA BAS. LA ARAUCANIA",null,"ESCUELA DIEGO PORTALES","ESCUELA BASICA JUAN DE DIOS ALDEA","COMPLEJO EDUCACIONAL LA REINA","COLEGIO BERNARDA MORIN","ESCUELA EL MAITEN","LICEO ANTONIO VARAS","ESCUELA BASICA LA COLONIA","ESCUELA BASICA F-N¦371 SANTA ROSA DE LAMPA","LICEO REPUBLICA DEL BRASIL","ESCUELA BASICA ROMILIO ARELLANO TRONCOSO","LICEO JUAN PABLO II DE LAS CONDES","ESC. BASICA NUMERO SEIS","ESCUELA DR.ARNOLDO EBENSPERGER RICHTER","ESCUELA LOS COPIHUES","ESCUELA BASICA LOS MAITENES","ESCUELA ESPECIAL LAS VIOLETAS","ESCUELA MUNICIPAL QUELENTARO","ESCUELA ELISA LATTAPIAT VARGAS","ESCUELA RURAL COLEGUAL","INSTITUTO ESTADOS AMERICANOS LO BARNECHEA","ESCUELA BASICA ACAPULCO","ESCUELA BASICA N¦389 REPUBLICA DE ESTADOS UNIDOS",null,"ESCUELA DOMITILA PINNA PARRA","ESCUELA CARDENAL JOSE MARIA CARO","ESCUELA DE ICALMA","ESCUELA JOSE ULLOA FIERRO","ESCUELA EL SAUCE","ESCUELA BÁSICA HITILHUE","ESCUELA NUEVA COLLILELFU","ESCUELA RURAL CAÑITAS",null,"ESCUELA BASICA PABLO BARRIOLHET","ESCUELA BALDOMERO LILLO FIGUEROA",null,"COLEGIO JUAN TACHOIRE MOENA","ESCUELA JOSE BERNARDO SUAREZ",null,"ESCUELA BÁSICA 1737 LOS ALERCES DE MAIP+","ESCUELA MUNICIPAL DE LIMAHUE",null,null,"ESCUELA BASICA G-N¦733 CHOROMBO BAJO","ESCUELA FRAY BERNABE DE LUCERNA","ESCUELA COLIN","ESCUELA RURAL DORILA AGUILA AGUILAR",null,null,"COLEGIO MONS. JAIME LARRAIN BUNSTER","ESCUELA CASA BLANCA","ESC.CONCENTRACION FRONTERIZA DE TULAHUEN","ESC. DE PARV. LAURITA VICUNA","ESCUELA BLANCO ENCALADA","ESCUELA EL SABER","ESCUELA BAS. ADRIANA LYON VIAL","ESCUELA CAPITAN JUAN LADRILLERO","ESCUELA FRANCISCO CHAVEZ CIFUENTES","ESCUELA BASICA VILLA COIGUE","ESCUELA GLORIAS NAVALES","ESCUELA BASICA ULDA ARACENA GONZALEZ","ESC. BASICA SANTA MARIA DE BOROA",null,"ESCUELA NUESTRA SRA. DE LA MERCED","ESCUELA BASICA LO NARVAEZ","ESCUELA DE ARTES Y CULTURA OSORNO","COLEGIO FRAY JORGE","ESCUELA REPUBLICA ARGENTINA","ESCUELA COLPANAO","ESCUELA MARIO AQUILES RODRIGUEZ","ESCUELA PROYECTO DE FUTURO","ESCUELA ALEMANIA",null,"ESCUELA MUNICIPAL LIHUEIMO","ESCUELA BASICA REPUBLICA DE CHILE","ESCUELA EMA LOBOS REYES",null,"ESCUELA MUNICIPAL LO VALDIVIA","ESCUELA EL LIBERTADOR","ESCUELA EMILIA LASCAR","COLEGIO LIKANKURA DE PEÑALOL+N","ESCUELA BASICA RICARDO E. LATCHMAN","ESCUELA PABLO CORREA MONTT","ESCUELLA BLANCA BUSTOS CASTILLO","ESCUELA BASICA VALLE HERMOSO","ESCUELA OSVALDO HIRIART CORVALAN","ESCUELA BASICA FORJADORES DE CHILE","ESCUELA GUSTAVO RIVERA BUSTOS",null,"ESCUELA EDUARDO FREI MONTALVA","ESCUELA JUAN VALDES ORTUZAR","ESCUELA VERTIENTE DEL SABER","ESCUELA BASICA PATAGUAS CERRO","ESCUELA DIVINO MAESTRO","ESCUELA JAVIER JARPA SOTOMAYOR","ESCUELA BASICA G-N¦646 LO ARCAYA","ESCUELA UNION LATINOAMERICANA","ESCUELA EL AMANECER",null,null,"ESCUELA BASICA LA TIRANA",null,"ESCUELA BASICA JUAN PABLO DUARTE","ESCUELA BASICA EL RINCON","ESCUELA BASICA MUNICIPAL DE EL CLARO","ESCUELA ALBERT EINSTEIN","ESCUELA BASICA PADRE ALBERTO HURTADO","ESCUEAL RURAL CHAICAS","ESCUELA RURAL LAS CASCADAS","COLEGIO ROSITA NOVARO DE NOVARO PUERTO VARAS",null,null,"ESCUELA DELLAMIRA REBECA AGUILAR","ESCUELA RURAL ICHUAC","ESCUELA PEDRO DE ONA","ESCUELA PURRANQUE","ESCUELA ALEJANDRINA CARVAJAL ASPEE",null,"ESCUELA RURAL ARMANDO SCHEUCH EPPLE",null,"ESCUELA EDUCADORA EULOGIA BORQUEZ PEREZ","ESCUELA RURAL AUCAR",null,"ESCUELA BASICA EL MANIO","LICEO ISABEL RIQUELME","ESCUELA BÁSICA PUERTO LOS FRUTALES DE COYANCO","ESCUELA BASICA ARAUCO","COLEGIO JOSE MIGUEL INFANTE","ESCUELA RURAL SAN FRANCISCO","ESCUELA JAIME FELDMAN MILLER","ESCUELA ANTUMALAL","ESCUELA BASICA REPUBLICA DE FRANCIA","ESCUELA NUEVA AMERICA","COLEGIO BENJAMIN VICUÑA MACKENNA","ESCUELA BASICA NUEVA ALDEA","ESCUELA LUIS LEYTON RUBIO","ESCUELA ANNE ELEONOR ROOSEVELT","LICEO POLITECNICO DOMINGO STA MARIA","ESCUELA BASICA ISABEL LE BRUN","COLEGIO MUNICIPAL EL CERRILLO","ESCUELA BASICA CAMPO LINDO","ESCUELA COPIHUE","ESCUELA PERFECTO DE LA FUENTE DEL VILLAR","ESCUELA PAMPA RIOS","ESCUELA PORVENIR","ESCUELA SAMO ALTO",null,"ESCUELA RIO NEGRO",null,"ESCUELA CARLOS LAZCANO ALFONSO","ESCUELA BASICA BARTOLO LLANCALEO","ESCUELA JOSE CANEPA VACCAREZZA","ESCUELA BASICA DIAGUITAS DE CHALINGA","ESCUELA BASICA CERRO PLACILLA","COLEGIO JAIME GUZM-N ERRAZURIZ","ESCUELA CACHAPOAL","ESCUELA BAJO PERQUIN","ESCUELA EL COBRE",null,"ESCUELA BASICA BERNARDO O HIGGINS R.","ESCUELA ABRAHAM LINCOLN DE AGUA BUENA",null,"ESCUELA CALLE ALEGRE","ESCUELA IRENE MORALES","COLEGIO CIUDAD DE FRANKFORT","ESCUELA BASICA F-N¦638 EL MELOCOTON",null,"ESCUELA GENERAL BASICA SANTA FE","ESCUELA BASICA MONTELEON","ESCUELA DELICIO CARDENAS BUSTAMANTE","ESCUELA BASICA G-N¦130","ESCUELA BASICA SAN PEDRO DE ATACAMA","COLEGIO NUEVOS HORIZONTES","ESCUELA PANGUE ARRIBA","ESCUELA BASICA KARELMAPU",null,"ESC. ENRIQUE YANEZ GONZALEZ","ESCUELA BASICA MANIL","ESCUELA ESPECIAL DE SANTA CRUZ","ESCUELA RECAREDO VIGUERAS ARANEDA","ESCUELA JULIO TEJEDOR ZUNIGA","ESCUELA BÁSICA F N¦ 64","ESCUELA EL CONVENTO",null,"ESCUELA EL PINO VIEJO DE LONQUEN","ESCUELA BASICA PUERTAS NEGRAS","COLEGIO BASICO NUEVA LOS LOBOS","ESCUELA VICTOR CARVAJAL MEZA","ESCUELA ALONSO DE ERCILLA","ESCUELA COMALLE","LICEO MUNICIPAL BARROS ARANA","ESCUELA DE CONCENTRACION","ESCUELA BASICA G-N¦352 PLAZUELA DE POLPAICO","ESCUELA CHACUIVI","ESCUELA ESTADOS UNIDOS DE NORTEAMERICA","ESCUELA EL SEMBRADOR","ESCUELA BASICA ARTURO PRAT",null,"ESCUELA ESPECIAL LAS LILAS DE TRAIGUEN",null,"ESCUELA LOS AVELLANOS","ESCUELA ALEMANIA","ESCUELA BASICA ESPANA","COLEGIO PEDRO MONTT","ESCUELA LAGO VICHUQUEN","ESCUELA BASICA SANTA ELENA","ESCUELA BASICA LUCILA GODOY ALCAYAGA","ESCUELA ALMIRANTE LUIS GOMEZ CARRENO","ESC. BASICA VEGA REDONDA","ESCUELA ALCALDE SERAFIN GUTIERREZ F.","ESCUELA BASICA CATALUNYA","ESCUELA JOSE ABELARDO NUNEZ",null,"ESCUELA MAITENCILLO","ESCUELA H+ROES DE CHILE","ESCUELA LOS MAYOS"]
[null,null,null,null,null,null,null,null,null,null,null,null,null,null,null,1,null,"Madre",null,"ALTO BIOBIO",null,"ESCUELA BASICA RIBERA SUR",null,"ESCUELA SAN ALFONSO","ESCUELA RALCO LEPOY",null,null,"ESCUELA RURAL BAHIA LINAO",null,"ESCUELA BASICA NAHUELBUTA","ESCUELA CLAUDIO MATTE PEREZ",null,"ESCUELA BASICA CESAR MONSALVE FLORES","ESC. GRAL. PEDRO LAGOS MARCHANT","ESCUELA LO SALINAS","ESCUELA CANTA RANA","ESCUELA BASICA SAN LORENZO",null,"ESCUELA COLICHEU","ESCUELA BASICA FEDERICO GANA","ESCUELA DE PARVULOS LLAMITO BLANCO","ESCUELA RURAL AGUANTAO",null,"ESCUELA BASICA IRMA SAPIAIN",null,"ESCUELA BASICA VALLE ALEGRE",null,"ESCUELA ESPECIAL ARCO IRIS","LICEO EUGENIA SUBERCASEAUX","ESCUELA MANUEL BRAVO REYES","ESCUELA LUIS URIBE DIAZ","ESCUELA EL COBRE","ESCUELA ARTISTICA BARRIO ESTACION","ESCUELA ESTRELLA REINA DE CHILE","ESCUELA BASICA PAULO FREIRE","ESCUELA BASICA GASPAR CABRALES",null,"ESCUELA PAHUIL","ESCUELA LUZ MARIA CRESPO URETA DE KERESTEGIAN","ESCUELA BASICA REPUBLICA DE GRECIA",null,"ESCUELA ARTURO MERINO BENITEZ","ESCUELA TOMAS LAGO","ESCUELA BAS. VILLA CONVENTO VIEJO",null,null,null,null,null,null,"COLEGIO MUNICIPAL DE CALLEJONES","ESCUELA JOSE FRANCISCO PINO MEDINA","ESCUELA PEDRO QUINTANA MANSILA","ESCUELA GENERAL PEDRO LAGOS MARCHANT","ESCUELA MUNICIPAL EL RULO","ESCUELA KURT MOLLER BOCHERENS",null,"ESCUELA BASICA ALGARROBAL","ESCUELA ESPECIAL ERICO HORNUNG","ESC. SUBTENIENTE JULIO MONTT SALAMANCA","ESCUELA BASICA PEDRO DE VALDIVIA","COLEGIO GRAN BRETAÑA","ESCUELA ATENEA",null,"ESCUELA LAS CORRIENTES",null,"ESCUELA BERNARDO O HIGGINS","ESCUELA BASICA DAVID LEON TAPIA","ESCUELA BASICA JAVIERA CARRERA",null,"ESCUELA VIDA Y PAZ","ESCUELA PATRICIO CHAVEZ SOTO","ESCUELA FERNANDO CARVAJAL PINTO","LICEO ALFREDO DEL CARMEN BARRIA OYARZUN","ESCUELA DE LENGUAJE RAYEN-ANTU","ESCUELA LICANCURA","ESCUELA PEDRO ANTONIO GONZALEZ","COLEGIO RAUQUEN CAMPO",null,null,"ESCUELA NIQUEN","ESC. DE PARVULOS MIS PRIMEROS PASOS","ESCUELA BENJAMIN CLARO VELASCO","ESCUELA BASICA AVIADORES","ESCUELA ELISE MOTTART","ESCUELA REPUBLICA DE HONDURAS",null,null,null,"ESCUELA CHACAIMAPU","ESCUELA BÁSICA HUMBERTO VALENZUELA GARC-A","LICEO INES ENRIQUEZ FRODDEN","ESCUELA JUAN SEGUEL",null,null,"ESCUELA RURAL LOS LINARES DE CASMA",null,"ESCUELA RURAL CURRINE","ESCUELA BASICA MANIUCO","ESCUELA BASICA LOS PERALES","ESCUELA MUNICIPAL VILLA LA COMPANIA",null,"ESCUELA BASICA LA SOMBRA",null,"ESCUELA RURAL N.745 SEMILLERO","ESCUELA BLANCA ESTELA PRAT CARVAJAL","ESCUELA MANUEL AMAT Y JUNIET",null,null,"ESCUELA LAS CANTERAS","ESCUELA BASICA LAS PALMERAS DE LIMAHUIDA","LICEO POLIVALENTE A80 PRESIDENTE JOSE MANUEL BALMACEDA","ESC.EDUC.ESPECIAL FLOR DEL INCA","ESCUELA BASICA FUTURO LAS MERCEDES",null,null,"ESCUELA BAS. OSCAR ENCALADA YOVANOVICH","COLEGIO MARIA ALONSO CHACON",null,"ESCUELA BASICA LOS NAVIOS","ESCUELA BAS. LOS HEROES DE YUNGAY",null,"ESCUELA GABRIELA MISTRAL","ESCUELA CAPITAN AVALOS","ESCUELA D-231 ESPECIAL DE DESARROLLO","COLEGIO CALETA SAN PEDRO","ESCUELA ESPECIAL DE LENGUAJE MUNICIPAL",null,"ESCUELA FRANCISCO PEDRO ZATTERA GUELFI","ESCUELA BASICA G-N¦373 EL LUCERO",null,"ESCUELA MUNICIPAL DE LOS AROMOS","LICEO SANTA MARIA DE LAS CONDES","ESC. BASICA VEGA LARGA","ESCUELA ESPECIAL JUAN SANDOVAL CARRASCO","LICEO AUGUSTO SANTELICES VALENZUELA","ESCUELA COEDUC TTE HERNAN MERINO CORREA","ESCUELA GRACIELA LETELIER",null,"ESCUELA HERMINIA ORTEGA DE CROXATO","ESCUELA RURAL LOS PELLINES",null,"ESCUELA BASICA BERNARDO O¦HIGGINS","ESCUELA GOLDA MEIR",null,"ESCUELA EGON ERNTS KEUTMANN BESGEN","ESCUELA CARLOS MONTERO JARAMILLO","ESCUELA DE LIUCURA","ESCUELA LAS DUNAS","ESCUELA ESPANA","ESCUELA BÁSICA LA RINCONADA DEL SALTO","ESCUELA NUEVA ESPANA","ESCUELA RURAL EL MELI",null,"ESCUELA BASICA TERESA CANNON DE B.","ESCUELA BASICA BELLO HORIZONTE",null,"COLEGIO LOS LLANOS","ESCUELA JULIO MONTT SALAMANCA",null,"ESCUELA BÁSICA MUNICIPAL SAN LUIS","ESCUELA MUNICIPAL DE PANQUEHUE",null,null,"ESCUELA BASICA G-N¦734 LAS MERCEDES","ESCUELA RURAL ALFONSO OSSES PEREZ","ESCUELA EL CANELO","ESCUELA RURAL FRANCISCO CORTES OJEDA",null,null,"COLEGIO POMAIRE","ESCUELA EL PROGRESO","ESCUELA ALEJANDRO CHELEN ROJAS","ESC. HIJOS DEL SOL","ESCUELA IGNACIO VERDUGO CAVADA","ESCUELA NACIMIENTO DE NUESTRO SEÑOR","ESCUELA MUNICIPAL DE CUNACO","ESCUELA CORONEL SANTIAGO BUERAS",null,"LICEO POLIVALENTE LA FRONTERA","ESCUELA ROSARIO CHACON BARRIOS","LICEO MUNICIPAL JUAN RUSQUE PORTAL","ESC. ESP.RET.MENTAL AVANCEMOS JUNTOS",null,null,"ESCUELA ESPECIAL HELLEN KELLER","ESCUELA EFRAIN CAMPANA SILVA","COLEGIO YUNGAY","LICEO PAUL HARRIS","ESCUELA DARIO SALAS","ESCUELA MUNICIPAL CIELO CLARO--PAIHUANO","ESCUELA ROBERTO OJEDA TORRES","ESCUELA BARBARA KAST RIST",null,"ESCUELA MUNICIPAL SANTA MATILDE","ESCUELA CLAUDIO ARRAU LEON","ESCUELA INDEPENDENCIA",null,"ESCUELA MUNICIPAL SAN PEDRO DE ALCANTARA","ESCUELA FRANCISCO MAUREIRA","ESCUELA MALLOCO","ESCUELA CARLOS HERNANDEZ PENA","ESCUELA BOROA","LICEO DE PELARCO","LICEO PELLUHUE","ESCUELA DAFNE ELVIRA ZAPATA ROZAS","ESCUELA PADRE LUIS OLIVA NAVARRETE","ESCUELA BASICA LOS CONQUISTADORES",null,null,"ESCUELA FERNANDO GARCIA OLDINI","ESCUELA MUNICIPAL ALCALDE G. BURMESTER",null,"ESCUELA BASICA SAN JOSE","ESCUELA PUEBLO DE VIUDAS","ESCUELA JOSE TOHA SOLDEVILLA","LICEO EL PRINCIPAL","LICEO MUNICIPAL LA FRONTERA","ESCUELA MUNICIPAL LA DEHESA",null,null,"ESCUELA BASICA MAMINA",null,null,"ESCUELA BASICA LA LAGUNA","ESCUELA CARLOS HOLZAFEL","ESCUELA ALEXANDER GRAHAM BELL","ESCUELA CASAS VIEJAS","ESCUELA ALEMANIA","ESCUELA RURAL NOCHACO","ESCUELA DIFERENCIAL `ASPADEP`",null,null,"ESCUELA DIECIOCHO DE SEPTIEMBRE","ESCUELA RURAL LAS CAMPANAS",null,"ESCUELA RURAL LA PAZ","ESCUELA CATAN DABIKE",null,"ESCUELA RURAL ESTACION NUEVO PORVENIR",null,"ESCUELA RURAL ADELA GARCIA GARCIA","ESCUELA RURAL BORDEMAR VILLA MECHUQUE",null,"ESCUELA BÁSICA PUCARA LASANA",null,"ESCUELA BASICA EL CASINO","ESCUELA BASICA CANADA","ESC.CDTE. ELEUTERIO RAMIREZ MOLINA","ESCUELA RURAL TERESA CARDENAS DE PAREDES","LICEO REPUBLICA DE ITALIA","ESCUELA BASICA MUNICIPAL GRENOBLE","ESCUELA JUAN JOSE TORTEL",null,"COLEGIO ESPANA","ESCUELA BASICA SAN IGNACIO DE PALOMARES","ESCUELA RAUCO","ESCUELA ESCRITORA MARCELA PAZ",null,"ESCUELA BASICA LO VELASQUEZ","COLEGIO MUNICIPAL LA ESMERALDA","ESCUELA BERTA SAAVEDRA SEGURA","ESCUELA LOS ROBLES",null,"ESCUELA RURAL CARIMALLIN BAJO","LICEO AGROINDUSTRIAL RIO CLARO",null,null,null,null,"ESCUELA FRANCISCO DE PAULA SANTANDER","ESCUELA BASICA COLLICO RANCO","ESCUELA LA ISLA","ESCUELA BASICA GUISELA GAMBOA SALINAS","ESCUELA BASICA CUNCUMEN","ESCUELA ABRAHAM LINCOLN","ESCUELA EL CARBON","ESCUELA BELLA UNION","ESCUELA EL CORAZON",null,"ESCUELA BASICA CAROLINA OCAMPO GARCIA","ESCUELA BAS.ABEL BOUCHON FAURE",null,"ESCUELA COLTON VARIANTE","ESCUELA JOSE MANUEL BALMACEDA","ESC. BAS. Y ESP. SU SANTIDAD JUAN XXIII","ESCUELA BASICA G-N¦635 INTEGRADORA EL MANZANO",null,"ESCUELA LLANO SUBERCASEAUX","ESCUELA BASICA PUENTE EL ALA","ESCUELA RURAL JULIO MOHR SCHULER","ESCUELA BASICA G-N¦134 NIHUE",null,"ESCUELA BASICA BOCA DEL BIO BIO SUR","ESCUELA SAN RAFAEL","ESCUELA BASICA SENDERO DEL SABER",null,"ESC.CARMEN GALLEGOS DE ROBLE","ESCUELA BASICA VILLACURA","ESCUELA GRANJA ADEODATO GARCIA VALENZUELA",null,"ESCUELA LA HIGUERA","ESCUELA BAS SALVADOR SANFUENTES REP EEUU",null,null,"ESCUELA EL ROTO CHILENO","ESCUELA BRILLA EL SOL","COLEGIO BASICO SAN VICENTE",null,"ESCUELA ANDRES BELLO","ESCUELA HUEMUL",null,"ESCUELA LUIS URIBE ORREGO","LICEO HUERTOS FAMILIARES","ESCUELA ELOISA GONZALEZ","ESCUELA GABRIELA MISTRAL","ESCUELA RAYEN LAFQUEN QUEULE","ESCUELA BASICA BELLAVISTA",null,"ESCUELA REPUBLICA DE ISRAEL",null,"ESCUELA LUIS MART-NEZ GONZ-LEZ","ESCUELA ANGACHILLA","ESCUELA BASICA GUALBERTO KONG FERNANDEZ","ESC. ESPEC. DE DEF. MENTAL GRAN BRETA_A","LICEO NUEVO HORIZONTE","ESCUELA HEROES DE IQUIQUE","ESCUELA DAGOBERTO CAMPOS NUNEZ","ESCUELA ARTURO PRAT CHACON","ESCUELA DAGOBERTO GODOY","ESCUELA ALFREDO NOGUERA PRIETO","ESCUELA BASICA DIEGO BARROS ARANA","ESCUELA MANANTIAL",null,"ESCUELA SANTA ANA DE QUERI","ESCUELA MUNICIPAL CERRO PARRA","LICEO CAMPANARIO"]
[null,null,null,null,null,null,null,null,null,null,null,null,null,null,null,2,null,"Abuelo/a",null,"ALTO DEL CARMEN",null,"ESCUELA CARLOS CONDELL",null,"LICEO MUNICIPAL SARA TRONCOSO TRONCOSO",null,null,null,"ESCUELA RURAL EL PALOMAR",null,"ESCUELA DIEGO DUBLE URRUTIA","ESCUELA DARIO SALAS DIAZ",null,"ESCUELA BASICA SAN PEDRO DE LARAQUETE","ESC. HUMBERTO VALENZUELA GARCIA","ESCUELA LOS ROSALES DEL BAJO","ESCUELA CELIA URRUTIA PRIETO","ESCUELA BASICA VALLE DE ARTIFICIO",null,"ESCUELA EL MANZANO","ESCUELA BASICA JUAN AGUILERA JEREZ","ESCUELA DE PARVULOS LOS CONEJITOS","ESCUELA RURAL CHAUQUEAR",null,"ESCUELA BASICA JOSEFINA HUICI",null,"ESCUELA VICTOR KOERNER",null,"ESCUELA TRANAPUENTE",null,"ESCUELA SAN PEDRO DE QUINTAY","ESCUELA PADRE HURTADO","ESCUELA MARIA TERESA DEL CANTO","ESCUELA ESPECIAL HORIZONTE","ESCUELA J.PRIETO VIAL","ESCUELA CIUDAD SANTO DOMINGO DE GUZMAN","ESCUELA BASICA IGNACIO DOMEYKO",null,"ESCUELA SAN AMBROSIO","ESCUELA MARIA MARTA DEL REAL CORREA","ESCUELA BELGICA",null,"ESCUELA BÁSICA ROSITA O¦HIGGINS RIQUELME","LICEO POLIVALENTE JUAN PACHECO ALTAMIRANO","ESCUELA BAS.FERNANDO ARENAS ALMARZA",null,null,null,null,null,null,"COLEGIO SANTA TERESA DE TUNCA","ESCUELA MARIA TERESA MARCHANT CONTRERAS","ESCUELA RURAL CON INTERNADO RIO BLANCO","ESCUELA GUARDIA MARINA ERNESTO RIQUELME",null,"ESCUELA LA FLORESTA",null,"ESCUELA BASICA MARCOS GOOYCOLEA CORTES","ESCUELA MICHIGAN EL AMANECER","ESCUELA CAPITAN IGNACIO CARRERA PINTO",null,"COLEGIO JUAN GREGORIO LAS HERAS","ESCUELA BASICA LIKAN-ANTAI",null,"ESCUELA SANTA AURORA DE CARRIZAL",null,"ESCUELA BRUNO ZAVALA FREDES","ESCUELA BASICA MANUEL DE SALAS","ESCUELA BASICA PATAGUAL",null,"LICEO ARTURO VALENZUELA","LICEO LAS ARAUCARIAS","ESCUELA SAN JOSE OBRERO DE CURACAVI",null,"ESCUELA GABRIELA MISTRAL","ESCUELA RUCA MANKE",null,"ESC.REPUBLICA ORIENTAL DEL URUGUAY",null,null,"ESCUELA PUERTAS DE VIRGUIN","ESCUELA CERRILLOS","ESCUELA DE ED.DIFERENCIAL HELLEN KELLER","ESCUELA BASICA BASE EL BOSQUE","ESCUELA ESPECIAL DE LENGUAJE MUNICIPAL EL CARMEN","ESCUELA REPUBLICA DEL ECUADOR",null,null,null,"ESCUELA MILLALEVIA","ESCUELA BASICA",null,"ESCUELA LA ESPERANZA",null,null,"ESCUELA VICENTE PEREZ ROSALES",null,"ESCUELA RURAL ISLA HUAPI","ESCUELA MUNICIPAL DE LLUQUENTUE","LICEO JOSE VICTORINO LASTARRIA","ESCUELA SIXTO MENDEZ PARADA",null,"ESCUELA BASICA LOS TILOS DE HUALCAPO",null,null,"ESCUELA HELEN KELLER ADAMS","ESCUELA NUEVA REPUBLICA",null,null,"ESCUELA SANTA VICTORIA DE HUECHURABA","ESCUELA BASICA SAN RAFAEL DE ROZAS","LICEO SAN FRANCISCO DE QUITO","ESCUELA ALMIRANTE PATRICIO LYNCH","LICEO REPUBLICA DE ITALIA",null,null,"ESCUELA ESPERANZA JOVEN","ESCUELA BASICA",null,"ESCUELA BELLAVISTA","ESCUELA BAS. POETA OSCAR CASTRO ZUNIGA",null,"ESCUELA MINISTRO GOMEZ MILLAS","ESCUELA MUNICIPAL VIOLETA PARRA","ESCUELA PALESTINA","COLEGIO CARLOS CONDELL DE LA HAZA","ESCUELA LA UNION",null,"ESCUELA JOSE ABELARDO NUNEZ","ESCUELA MANUEL SEGOVIA MONTENEGRO",null,"ESCUELA MUNICIPAL MAESTRO JORGE LOPEZ OSORIO","LICEO SIMON BOLIVAR","ESCUELA DOLLICO ALTO","ESCUELA FRESIA GRACIELA MULLER RUIZ",null,"ESCUELA LIMACHITO","ESCUELA LAS HORNILLAS",null,"ESCUELA HEROES DE IQUIQUE",null,null,"ESCUELA BASICA CLARA ESTRELLA","ESCUELA IGNACIO CARRERA PINTO",null,null,"ESCUELA DE PARVULOS SEMILLITA","ESCUELA DE TROYO","ESCUELA ORLANDO DELGADO ZUNIGA","ESCUELA ESPECIAL VALLE ANDINO","ESCUELA BASICA 11 DE SEPTIEMBRE","ESCUELA RURAL ANTILHUE","ESCUELA RURAL ESTAQUILLA",null,"ESCUELA CLARA VIAL ORREGO","ESCUELA BASICA CENTENARIO",null,"ESC. SAN JUAQUIN DE LOS MAYOS","ESCUELA VILLA MACUL",null,"ESCUELA BÁSICA N 263 RAMON FREIRE","ESCUELA PELEQUEN",null,null,"ESCUELA BASICA G-N¦737 SANTA EMILIA","ESCUELA RURAL JOSE ARNOLDO BILBAO","ESCUELA MAULE","ESCUELA RURAL HILDA HUNQUEN",null,null,"ESCUELA BASICA CARMEN BAJO","ESCUELA PRESIDENTE EDUARDO FREI MONTALVA","ESCUELA BASICA LA VILLA","ESC. SAN FRANCISCO DE ASIS","ESCUELA SACERDOTE ALEJANDRO MANERA","ESCUELA OSCAR GUERRERO QUINSAC","ESCUELA MUNICIPAL YAQUIL","ESCUELA LIB. BERNARDO O¦HIGGINS R.",null,null,null,null,"ESCUELA ALEJANDRO GOROSTIAGA",null,null,"ESCUELA LA DORMIDA","ESCUELA ESPAÑA","ESC. HEBERTO VELAZQUEZ VELAZQUEZ",null,"ESCUELA FUNDO MAQUEHUE",null,"ESCUELA RURAL 21 DE MAYO","ESCUELA BASICA F-N¦835 HERMANOS SANCHEZ CERDA",null,"ESCUELA REBECA CADIZ VALENZUELA","ESCUELA MANUEL ANABALÓN S-EZ","ESCUELA JORGE BARROS BEAUCHEF",null,"ESCUELA MUNICIPAL VILLA SAN PEDRO","ESCUELA FRANCISCO PEREZ LAVIN","ESCUELA MAND EDUARDO FREI MONTALVA","ESCUELA E-180 MATILDE HUICI NAVAS","ESCUELA CENTRO EDUC. REP. MEXICANA",null,null,"ESCUELA JOS+ REN+ SALGADO","ESCUELA SANTA LAURA DE LO FIGUEROA","ESCUELA EDUARDO CAMBELL SAAVEDRA",null,null,"ESCUELA HOGAR FRONTERIZA DE CHALACO",null,null,"ESCUELA ENRIQUE SERRANO DE VIALE RIGO",null,"ESCUELA PUERTA DE LA CORDILLERA","LICEO MUNIC. TEC. PROF. EL LLANO",null,"ESCUELA MUNICIPAL LA TUNA",null,null,"ESCUELA BASICA POZO ALMONTE",null,null,"ESCUELA HORCON","ESCUELA MUNICIPAL LOS ARRAYANES","ESCUELA ANTILHUE DE PUDAHUEL","ESCUELA CONSOLIDADA","ESCUELA ALERCE HISTORICO",null,"ESCUELA GRUPO ESCOLAR",null,null,"ESCUELA ELBA OJEDA GOMEZ",null,null,"ESCUELA RURAL NUEVA ISRAEL","ESCUELA EDUARDO BECERRA BASCUNAN",null,"ESCUELA RURAL LOS PELLINES",null,"ESCUELA RURAL ARTISTICA ALUMNO MARCELO GUENTEO SOLIS","ESCUELA RURAL LLIUCO",null,"ESCUELA ESTADO DE MICHIGAN",null,"ESCUELA BASICA HEROES DEL ITATA","ESCUELA BASICA LA PALMA","ESCUELA BASICA DARIO SALAS","LICEO INSULAR","VIOLETA FUENTES CARVAJAL","ESCUELA BASICA REINO DE NORUEGA","ESCUELA MANTAGUA",null,"COLEGIO MANUEL ROJAS",null,null,"ESCUELA ESPANA",null,"ESCUELA CAPITAN JOSE LUIS ARANEDA","COLEGIO MUNICIPAL LO CARTAGENA","ESCUELA CANADA","ESCUELA MANUEL MONTT",null,"ESCUELA RURAL COLONIA DIUMEN",null,null,null,null,null,"ESCUELA GERARDO RODRIGUEZ ORTUZAR","ESCUELA RUCA RAQUI","ESCUELA LO VALDIVIA","ESCUELA BASICA JULIO ECHAVARRIA","ESCUELA BASICA EL ASILO","ESCUELA ALEMANIA","ESCUELA EL SAUCE","ESCUELA BRAMADERO","ESCUELA INCLUSIVA SAN LORENZO",null,"ESCUELA BASICA JOSE DE SAN MARTIN","ESCUELA BAS.SAN JOSE DE LOS LINGUES",null,"ESCUELA LAS QUILAS","ESCUELA JOSE MIGUEL CARRERA","ESCUELA BÁSICA POETA NERUDA (EX-483)","ESCUELA BASICA G-N¦636 SAN ALFONSO",null,"ESCUELA TERRITORIO ANTARTICO","ESCUELA SERGIO MARTIN ALAMOS","ESCUELA RURAL LA POZA","ESCUELA BASICA G-N¦139",null,"ESCUELA BASICA LUIS ALBERTO ACEVEDO",null,"ESCUELA BASICA TUPAHUE",null,"ESC.GUIDO ASSIS GONZALEZ","ESCUELA DE EDUCACIÓN GENERAL BÁSICA EL HUACHI","ESCUELA MARIA ARAYA VALDES",null,"ESCUELA MARIA ESPINOLA CASTRO","ESCUELA BASICA BENJAMIN VICUNA MACKENNA",null,null,"ESCUELA LUIS UNDURRAGA","ESCUELA CARLOS SPANO","COLEGIO HUACHIPATO",null,"ESCUELA ARTISTICA ARMANDO DUFEY BLANC","ESCUELA LAS ARBOLEDAS",null,"ESCUELA PAUL HARRIS","LICEO MONTENEGRO","ESCUELA HECTOR ISAAC CARRASCO HELDT","ESCUELA L.GRAL.BERNARDO O¦HIGGINS R.",null,"ESCUELA BASICA CALETA DEL MEDIO",null,null,null,null,"ESCUELA CHILE","ESCUELA BASICA ROBERTO CUADRA ALQUINTA","ESCUELA ALEMANIA",null,"ESCUELA MARCELA PAZ","ESCUELA DE DIAGUITAS JUAN TORRES M.","ESCUELA BASICA 21 DE MAYO","ESCUELA JAPON","ESCUELA HERNAN LOBOS ARIAS","ESCUELA DIEGO PORTALES","ESCUELA MARIANO LATORRE",null,"ESCUELA SANTA ELENA","ESCUELA MUNICIPAL RERE"]
["* Corresponde al reemplazo de un RINJU por defectos de fábrica",null,null,null,null,{"$f":"IF(Q1=1,\"RUN CORRECTO\",IF(Q1=0,\"RUN INCORRECTO\",\"\"))","v":""},null,null,{"$f":"IF(Q2=1,\"RUN CORRECTO\",IF(Q2=0,\"RUN INCORRECTO\",\"\"))","v":""},null,null,null,null,null,null,3,null,"Tio/a",null,"ALTO HOSPICIO",null,"ESCUELA LITORAL AUSTRAL",null,null,null,null,null,"ESCUELA RURAL LUIS ALBERTO SEGOVIA ROSS",null,"ESCUELA HERMANOS CARRERA","ESCUELA DE PARVULOS BLANCA NIEVES",null,"ESCUELA BASICA VICENTE MILLAN IRIARTE","ESCUELA AMERICA","ESCUELA VALDIVIA DE PAINE","ESCUELA COLTON QUILLAY","ESCUELA ESTER SILVA SOMARRIVA BARTOLILLO",null,"ESCUELA EL PARAISO","ESCUELA BASICA JUAN LAVIN ALVEAR","ESCUELA DE PARVULOS LOS ENANITOS","ESCUELA RURAL CHAYAHUE",null,"ESCUELA BASICA PALESTINA",null,null,null,"ROMILIO ADRIAZOLA",null,null,"ESCUELA RURAL ANA NELLY OYARZUN CARTES","ESCUELA SAN JOSE DE CATEMU","ESCUELA INDEPENDENCIA","ESCUELA LOTHAR KOMMER BRUGER","ESCUELA DOCTOR TREVISO GIRARDI TONELLI","ESCUELA BASICA PEDRO LUJAN",null,null,null,"ESCUELA LA ESPERANZA",null,"ESCUELA BASICA CAPILLA COX",null,"ESCUELA ESPECIAL AYUDANDO A CRECER",null,null,null,null,null,null,"ESCUELA EUGENIO GARCIA FERNANDEZ","ESCUELA VILLA JESUS DE COELEMU","ESCUELA RURAL PABLO NERUDA","ESCUELA HEROES DE IQUIQUE",null,"ESCUELA LOMAS DE PUTAGAN",null,"ESCUELA BASICA SAN VICENTE DE LO ARCAYA","ESCUELA MININCO","ESCUELA MUNIC.SBTE LUIS CRUZ MARTINEZ",null,"COLEGIO MARINA DE CHILE","ESCUELA CAMILO HENRIQUEZ",null,"ESCUELA SUPERIOR NUEVA BILBAO",null,"ESCUELA DIFERENCIAL PUKARA","ESCUELA BASICA MARIO MUNOZ SILVA","ESCUELA BASICA PLAYAS NEGRAS",null,"LICEO MUNICIPAL ATENEA",null,null,null,"ESCUELA INDEPENDENCIA",null,null,"ESCUELA AGUAS NEGRAS",null,null,"ESCUELA SAN JORGE DE NIQUEN","ESCUELA LAURA MATUS MELENDEZ","ESCUELA DIFERENCIAL MUNICIPAL AMAPOLAS","ESCUELA BASICA JOSE MARTI","ESCUELA MATA REDONDA","LICEO POLIV. LUIS HUMBERTO ACOSTA GAY",null,null,null,"LICEO ALONSO DE ERCILLA Y ZUÑIGA","ESCUELA BASICA JAPON",null,null,null,null,null,null,"ESCUELA RURAL NONTUELA","ESCUELA MUNICIPAL GABRIELA MISTRAL",null,null,null,"ESCUELA BASICA RABUCO",null,null,"ESCUELA REPUBLICA DEL PERU",null,null,null,"ESCUELA SANTIAGO DE GUAYAQUIL","ESCUELA BASICA VALLE DEL CHOAPA",null,"ESCUELA CALETA SAN MARCOS",null,null,null,"LICEO POLIVALENTE OLOF PALME",null,null,"ESCUELA DE PARVULOS SAMORITO","ESCUELA BAS. TECNO SUR",null,"ESCUELA REPUBLICA DE VENEZUELA","ESCUELA PABLO DE ROKHA","LICEO EUGENIO MAR-A DE HOSTOS","COLEGIO COQUIMBITO","ESCUELA PRESIDENTE JORGE ALESSANDRI R.",null,"ESCUELA LAS CI+NAGAS","ESCUELA POLONIA GUTIERREZ C.",null,"ESCUELA MUNICIPAL VILMA ALIAGA CALDERON",null,"ESCUELA IRENE FREI","ESCUELA GUILLERMO RODRIGUEZ RIOBIO",null,"ESCUELA SUPERIOR MIXTA N¦ 88","ESCUELA LAS TOSCAS",null,"ESCUELA JORGE PRIETO LETELIER",null,null,"ESCUELA BASICA COEDUCACIONAL","ESCUELA JAIME GOMEZ GARCIA",null,null,"ESCUELA EL CARMEN","ESCUELA MUNICIPAL FRONTERIZA","ESCUELA PILPILCO","ESCUELA FERROVIARIA","ESCUELA BASICA 21 DE MAYO","ESCUELA RURAL EL SALTO","ESCUELA RURAL PARAGUAY CHICO",null,null,"ESCUELA BASICA COLCURA",null,"ESCUELA CHACAYES",null,null,"ESCUELA BASICA REINA DE SUECIA",null,null,null,"LICEO MUNICIPAL F-N¦860","ESCUELA RURAL MISSISSIPPI","ESCUELA QUINIPEUMO","ESCUELA RURAL JUANITA GALLARDO",null,null,"ESCUELA BASICA EL PABELLON","ESCUELA QUECHEREGUAS DE PICHINGAL","ESCUELA CHILECITO","ESCUELA EL RINCON","ESCUELA VILLA LA GRANJA","ESCUELA TOQUI LAUTARO",null,null,null,null,null,null,"ESCUELA ARENAS BLANCAS",null,null,"ESCUELA LAS PALMAS DEL NIÑO DIOS","ESCUELA FUNDACION PAUL HARRIS","ESC.BAS.JUAN PABLO ARTIGUES PENAFIEL",null,"ESCUELA LAUREL HUACHO",null,"ESCUELA RURAL EL LLOLLY","ESCUELA BASICA G N¦831 JAVIER EYZAGUIRRE ECHAURREN",null,"LICEO SAN JOSE DEL CARMEN","ESCUELA MARIA ALVARADO GARAY",null,null,"ESCUELA UNION DE MUJERES AMERICANAS","ESCUELA IGNACIO URRUTIA DE LA SOTTA","ESCUELA REPUBLICA CHECA","ESCUELA ESPECIAL PONTIFICE JUAN PABLO II","ESCUELA CIUDAD DE BARCELONA",null,null,null,null,"ESCUELA ETHEL HENCK DE GRANT",null,null,"LICEO CORDILLERA",null,null,"ESCUELA ESPECIAL DE PICHIDEGUA",null,null,null,null,"LICEO SAN FRANCISCO",null,null,"ESCUELA ESTRELLA DEL SUR",null,null,"ESCUELA LA CHOCOTA",null,"ESCUELA BASICA MELVIN JONES","ESCUELA EJERCITO LIBERTADOR","ESCUELA ANAHUAC",null,"ESCUELA RURAL COLONIA RIO SUR",null,null,"ESCUELA ESPANA",null,null,"ESCUELA VILLA LO BURGOS","ESCUELA MARIA LEIVA DE IBANEZ",null,"ESCUELA RURAL PILMAIQUEN",null,"ESCUELA RURAL YALDAD","ESCUELA RURAL MONTEMAR",null,"ESCUELA LUIS CRUZ MARTINEZ",null,"ESCUELA BASICA HUACAMALA","ESCUELA BASICA LAS PATAGUAS","ESCUELA BASICA GASPAR CABRALES",null,null,"ESCUELA CALICANTO",null,null,"COLEGIO MUNICIPAL EDUARDO DE GEYTER",null,null,"ESCUELA PUERTO RICO",null,"ESCUELA DOMINGO SANTA MARIA GONZALEZ","COLEGIO MUNICIPAL LO DE LOBO","ESCUELA DAVID DEL CURTO","ESCUELA ROMERAL",null,"ESCUELA RURAL CRUCERO",null,null,null,null,null,"ESCUELA GUAICO CENTRO","LICEO REINO DE SUECIA","ESCUELA SANTA ROSA","ESCUELA BASICA PANGUESILLO","ESCUELA BASICA LEYDA","ESCUELA BASICA ANTUPILLAN","ESCUELA ESPECIAL RENACER","ESCUELA CHEQUEN DE LA PENA","ESCUELA LO CALVO",null,"ESCUELA BUCALEMITO","ESCUELA BASICA ANTONIO LARA MEDINA",null,"ESCUELA MAR-A LUISA ESPINOZA RUIZ","ESCUELA JUAN DE DIOS ALDEA","ESCUELA BASICA FRAY CAMILO HENRIQUEZ","ESCUELA JULIETA BECERRA ALVAREZ",null,"ESCUELA VILLA SAN MIGUEL","LICEO T+CNICO PUENTE ÑUBLE","ESCUELA RURAL TRUMAO","ESCUELA ENRIQUE REYMOND ALDUNATE",null,"ESCUELA BASICA MICHAIHUE",null,"ESCUELA BASICA VILLA LA CULTURA",null,"ESC.JUAN BARROS ROLDAN","ESCUELA LOS BOLDOS","ESCUELA MUNICIPAL DE BARREALES",null,"ESCUELA SANTA FILOMENA","ESCUELA BASICA IRENE FREI DE CID",null,null,"ESCUELA MANUEL RODRIGUEZ ERDOIZA","ESCUELA CARLOS TRUPP WANNER","COLEGIO LOS CONDORES",null,"ESCUELA ARTURO PRAT","ESCUELA LAS LIRAS",null,"ESCUELA VICTOR MANUEL SANCHEZ CABANAS","LICEO POLIVALENTE MANUEL RODRIGUEZ","ESCUELA MAPODUNGUN","ESCUELA PABLO NERUDA",null,"ESCUELA BASICA CARLOS MAHNS CHOUPAY",null,null,null,null,"ESCUELA DE NIEBLA JUAN BOSCH","ESCUELA BASICA SARA BEMBOW VILLEGAS","ESCUELA AMERICA",null,"ESCUELA MUNICIPAL MONICA GEBERT MEIER","ESCUELA EDMUNDO VIDAL CARDENAS","ESCUELA BASICA CHORRILOS","ESCUELA MARTIN ALONQUEO PIUTRIN","ESCUELA JOSE PALMA FERNANDEZ","ESCUELA EL PATAGUAL","ESCUELA VALENTIN LETELIER",null,"ESCUELA SILVANO FERNANDEZ","ESCUELA PADRE PEDRO CAMPOS MENCHACA"]
["ID","Estado","Fecha de Entrega","Entrega de reposición*","Niño(a) o adulto sin Rol Único Nacional (RUN)","RUN Niño(a)","DV","Nombre completo niño","RUN adulto receptor","DV","Nombre completo adulto receptor","Parentesco del niño(a) con adulto receptor",null,null,null,4,null,"Hermano/a",null,"ANCUD",null,"ESCUELA PEDRO AGUIRRE CERDA",null,null,null,null,null,"ESCUELA RURAL MANAO",null,"ESCUELA JOS+ EL-AS BOLIVAR HERRERA","ESCUELA DE PARVULOS LOS PINGUINITOS",null,"ESCUELA EDELMIRA VERGARA QUIÑONES","ESCUELA CARLOS CONDELL DE LA HAZA","ESCUELA VILLASECA","ESCUELA EL CARACOL","ESCUELA HANS WENKE MENGERS",null,"ESCUELA EL PROGRESO","ESCUELA BASICA LA GRANJA","ESCUELA DE PARVULOS PAPELUCHO","ESCUELA RURAL EL ROSARIO",null,"ESCUELA BASICA SANTA ROSA DEL HUERTO",null,null,null,null,null,null,"ESCUELA RURAL MIRTA OYARZO VERA",null,"ESCUELA LOS CONQUISTADORES","ESCUELA SANTA ADELA","ESCUELA ESPECIAL SGTO.CADELARIA",null,null,null,null,"ESCUELA REPUBLICA FEDERAL ALEMANA",null,"ESCUELA BASICA COLLIGUAY",null,"ESCUELA MUNICIPAL",null,null,null,null,null,null,null,null,"ESCUELA RURAL VALLE DE LA LUNA","ESCUELA MANUEL MATUS HERMOSILLA",null,"ESCUELA MAULE SUR",null,"ESCUELA BASICA SANTA MARTA DE LIRAY","ESCUELA NICOLAS PEREZ CARDENAS","ESCUELA MUNICIPAL DE RINCONADA DE IDAHUE",null,"ESCUELA BÁSICA COM+N HOSPITAL","ESCUELA D-114",null,"LICEO RURAL ENRIQUE MAC IVER",null,"ESCUELA EL CHANAR","ESCUELA BASICA REPUBLICA DE ITALIA","ESCUELA BASICA RAMON FREIRE SERRANO",null,null,null,null,null,"ESCUELA PABLO NERUDA",null,null,"ESCUELA CATALUNA",null,null,"ESCUELA ZEMITA","ESCUELA LO MIRANDA","ESCUELA GUILLERMO ZANARTU IRIGOYEN","ESCUELA BASICA MARIO ARCE GATICA","ESCUELA NAVIDAD-TREHUALEMU",null,null,null,null,null,"ESCUELA BASICA PACTO ANDINO",null,null,null,null,null,null,null,"ESCUELA MUNICIPAL RIO QUILLEN",null,null,null,"ESCUELA MONICA HURTADO EDWARDS",null,null,"ESCUELA THOMAS JEFFERSON D 465",null,null,null,null,"ESCUELA BASICA VILLA LOS NARANJOS",null,"ESCUELA CENTENARIO",null,null,null,null,null,null,"ESCUELA ELSA SANTIBANEZ","ESCUELA BASICA ISLAS DE CHILE",null,null,"LICEO MUNICIPAL EL ROBLE",null,"COLEGIO DE ALGARROBITO","ESCUELA RADIMADI",null,"ESCUELA NIVEQUETEN","ESCUELA REPUBLICA DE POLONIA",null,"ESCUELA REPUBLICA DE GRECIA",null,"ESCUELA LOS CACHORROS","ESCUELA LA FORTUNA",null,null,"ESCUELA LLANKANAO MANUEL FRANCISCO MEZA SECO",null,"ESCUELA LAS PALMAS",null,null,"ESCUELA BASICA REPUBLICA DE LAS FILIPINAS","ESCUELA MARISCAL DE AYACUCHO",null,null,"ESCUELA FRANCISCO URRUTIA URRUTIA",null,"ESCUELA ZAIDA ARANEDA VIGUERAS","ESCUELA GABRIELA MISTRAL","ESCUELA BASICA CHACAYAL SUR","ESCUELA RURAL FOLILCO",null,null,null,"ESCUELA BASICA KONRAD ADENAUER",null,"PARVULARIO GRAL. O. BONILLA",null,null,"ESCUELA ESPECIAL ANDALUE",null,null,null,null,"ESCUELA VALLE DE MARIQUINA","ESCUELA RURAL DUAO","ESCUELA RURAL LOS ARCES",null,null,"ESCUELA CLAUDIO ARRAU","ESCUELA REINO DE DINAMARCA","ESCUELA DE FLOR DEL VALLE","ESCUELA ESPECIAL MARIA ALICIA PONCE",null,null,null,null,null,null,null,null,"ESCUELA BASICA EL CRUCERO",null,null,"ESCUELA MONTEVIDEO","ESCUELA GARCIA HURTADO DE MENDOZA","ESC.BASICA SAN ANTONIO DE LA VILLA",null,"ESCUELA LICANCO",null,"ESCUELA RURAL ESTRELLA DE CHILE","ESCUELA BASICA G-N¦830 FRANCISCO LETELIER VALDES",null,null,"ESCUELA RURAL HUELLAHUE",null,null,null,"ESCUELA JOSE MATTA CALLEJON","ESCUELA REPUBLICA DE ISRAEL","ESCUELA JUAN BAUTISTA PASTEN","ESCUELA CONSOLIDADA DAVILA",null,null,null,null,"ESCUELA ISLA DE PASCUA",null,null,"LICEO JOSE MANUEL BORGONO NUNEZ",null,null,"ESCUELA LARMAHUE",null,null,null,null,null,null,null,"OASIS EN EL DESIERTO",null,null,"ESCUELA LA GREDA",null,"ESCUELA EL SALITRE","ESCUELA LAS PALMAS","ESCUELA BASICA KIMUN LAWAL",null,"ESCUELA RURAL EPSON DE ENSENADA",null,null,"ESCUELA ESPECIAL ROTARIO PAUL HARRIS",null,null,null,"ESCUELA PASO HISTORICO EL TARTARO",null,null,null,null,"ESCUELA RURAL SANTA ROSA",null,"ESCUELA MUNICIPAL VALLE DE LUNA",null,"ESCUELA BASICA LIUCURA BAJO","ESCUELA BASICA RAMON FREIRE","ESCUELA BASICA JORGE ROCK LARA",null,null,"ESCUELA DIEGO PORTALES",null,null,"COLEGIO PABLO GARRIDO",null,null,"ESCUELA RAFAEL VALDIVIESO",null,"ESCUELA GENERAL ALEJANDRO GOROSTIAGA O","COLEGIO MUNICIPAL LOS CHOAPINOS","ESCUELA MUNICIPAL SANTA AMALIA","ESCUELA SANTA CECILIA",null,"ESCUELA RURAL EL ARRAYAN",null,null,null,null,null,"ESCUELA RAMON FREIRE",null,"ESCUELA VILLA PRAT","ESCUELA COIRON","ESCUELA BASICA SAN JOSE DE CALASANZ","ESCUELA BASICA CINCO PINOS","ESCUELA GENERAL DOMINGO URRUTIA","ESCUELA CORRALONES","ESCUELA PABLO NERUDA",null,"ESCUELA BUEN PASTOR","ESCUELA BASICA GASPAR MARIN",null,"ESCUELA MAYULERMO","ESCUELA JULIO MONTT SALAMANCA","ESCUELA POETA VICTOR DOMINGO SILVA",null,null,null,null,null,"LICEO MUNICIPAL DE SAN PEDRO",null,"ESCUELA DARIO SALAS MARCHANT",null,"ESCUELA NANIHUE",null,"ESC.PARROCO M.BUSTAMANTE","ESCUELA MARIANO PUGA VEGA","ESCUELA MUNICIPAL DE GUINDO ALTO",null,"LICEO DARIO SALAS","ESCUELA BASICA PROVINCIA DE CHILOE",null,null,"ESCUELA REPUBLICA DE GRECIA","ESCUELA CENTINELA","COLEGIO REMODELACION SIMONS",null,"ESCUELA BOYECO","ESCUELA LOS ALISOS",null,null,null,"ESCUELA PRIMER AGUA",null,null,"ESCUELA BASICA CERRO ESTANQUE",null,null,null,null,"ESCUELA EL BOSQUE","ESCUELA BASICA SOR TERESA DE LOS ANDES","ESCUELA BASICA CIRUJANO VIDELA",null,"ESCUELA PAILAHUEQUE","ESCUELA FEDERICO BARNES PAYNE","ESCUELA BASICA DR ALDO FRANCIA BOIDO",null,"ESCUELA PROFESOR RAMON LEIVA NARVAEZ","ESCUELA JUAN BAUTISTA ALBERDI","ESCUELA VOIPIR DE NANCUL",null,"LICEO JUAN DE DIOS PUGA","LICEO MUNICIPAL RIO CLARO"]
[1,{"$f":"IF(E9=\"No\",IF(COUNTBLANK(C9:L9)=0,\"Completo\",IF(COUNTBLANK(C9:L9)=10,\"\",\"Falta información\")),IF(E9=\"Si\",IF(COUNTBLANK(C9:L9)=4,\"Completo\",IF(COUNTBLANK(C9:L9)=10,\"\",\"Falta información\")),\"Falta información\"))","v":"Falta información"},null,null,null,null,null,null,null,null,null,null,null,null,null,5,null,"Otro",null,"ANDACOLLO",null,"LICEO MANIHUALES",null,null,null,null,null,"ESCUELA RURAL SAN MIGUEL DE COÑIMO",null,"ESCUELA REPUBLICA FEDERAL ALEMANA","ESCUELA DE PARVULOS MARCELA PAZ",null,"ESCUELA ESPECIAL DE LENGUAJE ARAUCO","ESCUELA DARIO SALAS DIAZ","ESCUELA VILUCO","ESCUELA EL PALPAL DE SANTA CLARA","ESCUELA PABLO NERUDA",null,"ESCUELA LAS OBRAS","ESCUELA BASICA LLONCAO","ESCUELA DE PARVULOS QUILLA ANTAY","ESCUELA RURAL PARGUA",null,"ESCUELA BASICA VILLA LA FLORIDA",null,null,null,null,null,null,"ESCUELA RURAL OLINDA BORQUEZ BORQUEZ",null,"ESCUELA OCTAVIO PALMA PEREZ","LICEO POLIVALENTE DR. LUIS VARGAS SALCEDO","ESCUELA FEDERICO ACEVEDO SALAZAR",null,null,null,null,"LICEO JOSE HIPOLITO SALAS Y TORO",null,"ESCUELA BASICA CONFLUENCIA",null,"ESCUELA MUNICIPAL",null,null,null,null,null,null,null,null,"ESCUELA RURAL VALLE SIMPSON","ESCUELA MARTA COLVIN ANDRADE",null,"ESCUELA MONSENOR MANUEL LARRAIN E.",null,"ESCUELA BASICA SANTA TERESA DEL CARMELO","ESCUELA THOMAS ALBA EDISON","ESCUELA MUNICIPAL DE VINA LA CRUZ",null,"ESCUELA BÁSICA IRENE FREI DE CID","ESCUELA DRA.ELOISA DIAZ INSUNZA",null,"LICEO RURAL PUTU",null,"ESCUELA EL PALOMAR","ESCUELA CARDENAL JOSE MARIA CARO","ESCUELA ESCUADRON",null,null,null,null,null,"ESCUELA RAMIRO ROA GONZALEZ",null,null,"ESCUELA DIEGO PORTALES P.",null,null,"LICEO SAN GREGORIO","ESCUELA PLAZUELA","ESCUELA JUAN MOYA MORALES","ESCUELA BASICA PAUL HARRIS","ESCUELA VIRGEN DEL CARMEN",null,null,null,null,null,"ESCUELA BASICA PROF.RAMON DEL RIO",null,null,null,null,null,null,null,"ESCUELA SAN JUAN DE AILLINCO",null,null,null,"LICEO MUNICIPAL LUIS LABORDA",null,null,"LICEO T+CNICO PROFESIONAL LUCILA GODOY ALCAYAGA",null,null,null,null,"ESCUELA JUAN CARRASCO RISCO",null,"ESCUELA CHIPANA",null,null,null,null,null,null,"ESCUELA GUARDIAMARINA ERNESTO RIQUELME","ESCUELA BELGICA",null,null,"LICEO MUNICIPALIZADO CENT.ED. LA PINTANA",null,"COLEGIO GABRIEL GONZALEZ VIDELA","ESCUELA RURAL ALDEA CAMPESINA",null,"ESCUELA PUENTE PERALES","ESCUELA SANTA BARBARA",null,null,null,"ESCUELA LOS CARRERA","ESCUELA PEHUEN",null,null,"ESCUELA LOS LEONES",null,"ESCUELA LAS PENAS",null,null,"ESCUELA BASICA SALOMON SACK","ESCUELA POETA PABLO NERUDA",null,null,"ESCUELA GABRIEL BENAVENTE BENAVENTE",null,null,"ESCUELA IGNACIO CARRERA PINTO","ESCUELA BASICA EL AMANECER DE DUQUECO",null,null,null,null,"ESCUELA BASICA SANTA MARIA DE GUADALUPE",null,null,null,null,"ESCUELA GENERAL OHIGGINS",null,null,null,null,"LICEO POLITECNICO PESQUERO","ESCUELA RURAL NUMPAY",null,null,null,"ESCUELA GRAL. CAROL URZUA","ESCUELA SAN PEDRO DE MOLINA","ESCUELA EL PALQUI","LICEO ELVIRA SANCHEZ DE GARCES",null,null,null,null,null,null,null,null,"ESCUELA BASICA MANIO DUCANAN",null,null,null,"ESCUELA JUAN RICARDO SANCHEZ ASCENCIO","ESC.PADRE JOSEPH BENEDIKT STEGMEIER",null,"ESCUELA METRENCO",null,null,"ESCUELA BASICA G-N¦832 AGUILA SUR",null,null,"ESCUELA RURAL LA RINCONADA",null,null,null,"ESCUELA LUIS ARMANDO GOMEZ MUNOZ","ESCUELA ROSALINA PESCIO VARGAS","ESCUELA LUIS ARRIETA CANAS","ESCUELA DE PARVULOS RAYITO DE LUZ",null,null,null,null,"ESCUELA LA GREDA",null,null,null,null,null,"ESCUELA MUNICIPAL DE CALEUCHE",null,null,null,null,null,null,null,null,null,null,"ESCUELA MAITENCILLO",null,"ESCUELA ELVIRA SANTA CRUZ OSSA","ESCUELA LOS ANDES","ESCUELA BASICA LAS CAMELIAS",null,null,null,null,"ESCUELA GENERAL MANUEL BULNES P.",null,null,null,"ESCUELA RENACER",null,null,null,null,"ESCUELA RURAL TAC",null,"ESCUELA PROFESORA MARIA LUISA SEPULVEDA",null,"ESCUELA BASICA PASO EL ROBLE","ESCUELA BASICA REPUBLICA DE MEXICO","ESCUELA GUARDIAMARINA GUILLERMO ZANARTU I.",null,null,"ESCUELA ESPANA",null,null,"COLEGIO SANTA FILOMENA",null,null,"ESCUELA SARGENTO 2. DANIEL REBOLLEDO",null,"ESCUELA GENERAL MANUEL BULNES PRIETO","COLEGIO MUNICIPAL LUIS GALDAMES","LICEO REQUINOA","ESCUELA SANTA DELFINA",null,"ESCUELA RURAL MANTILHUE ALTO",null,null,null,null,null,"ESCUELA TRES ESQUINAS",null,null,"ESCUELA EL TAMBO","ESCUELA CRISTO DEL MAIPO","ESCUELA BASICA DR LUIS SEPULVEDA SALVATI","ESCUELA GENERAL JOS+ MIGUEL CARRERA VERDUGO","ESCUELA DE PARVULOS SAN CLEMENTE","ESCUELA RIO COLORADO",null,"ESCUELA CARMELA CARVAJAL DE PRAT","ESCUELA BASICA ISABEL LA CATOLICA",null,"ESCUELA SELVA NEGRA","ESCUELA JUSTA NARVAEZ","LICEO MUNICIPAL SAN JOAQUIN",null,null,null,null,null,null,null,"ESCUELA ENRIQUE SORO BARRIGA",null,"LICEO MUNICIPAL PURKUYEN",null,"ESCUELA EL LIBERTADOR",null,"ESCUELA MUNICIPAL DE ISLA DE YAQUIL",null,null,"ESCUELA BASICA REPUBLICA DE COLOMBIA",null,null,"LICEO POLIVALENTE TALAGANTE","ESCUELA COOPERATIVA LIRCAY MANUEL YAÑEZ OLAVE","ESCUELA BASICA BUENA VISTA",null,"ESCUELA CAMPOS DEPORTIVOS","ESCUELA MONTERILLA",null,null,null,null,null,null,"ESCUELA BASICA COCHOLGUE",null,null,null,null,"ESCUELA EL LAUREL","ESCUELA EDMUNDO QUEZADA ARAYA","ESCUELA BLAS CUEVAS RAMON ALLENDE",null,"ESCUELA SELVA OSCURA","ESCUELA JOSE ABELARDO NUNEZ","ESCUELA BASICA HUMBERTO VILCHEZ ALZAMORA",null,"ESCUELA TIMOTEO ARAYA ALEGRIA","ESCUELA LATINA INES GALLARDO ORELLANA",null,null,"LICEO JUAN GOMEZ MILLAS","LICEO T+CNICO PROFESIONAL GONZALO GUGLIELMI MONTIEL"]
[2,{"$f":"IF(E10=\"No\",IF(COUNTBLANK(C10:L10)=0,\"Completo\",IF(COUNTBLANK(C10:L10)=10,\"\",\"Falta información\")),IF(E10=\"Si\",IF(COUNTBLANK(C10:L10)=4,\"Completo\",IF(COUNTBLANK(C10:L10)=10,\"\",\"Falta información\")),\"Falta información\"))","v":"Falta información"},null,null,null,null,null,null,null,null,null,null,null,null,null,6,null,null,null,"ANGOL",null,null,null,null,null,null,null,"ESCUELA RURAL SENDA CHACAO",null,"ESCUELA VILLA HUEQUEN","ESCUELA DE PARVULOS SEMILLITA",null,"ESCUELA JORGE IVAN VALENZUELA ZUNIGA","ESCUELA DR. RICARDO OLEA GUERRA","LICEO 131","ESCUELA EVARISTA OGALDE ORTEGA",null,null,"ESCUELA ORLANDO VERA VILLARROEL","ESCUELA BASICA RENE ANDRADES TOLEDO","ESCUELA DIFERENCIAL LOA","ESCUELA RURAL PEÑASMO",null,"ESCUELA ESPECIAL JESUS DE NAZARETH",null,null,null,null,null,null,"ESCUELA RURAL PEDRO VELAZQUEZ BONTES",null,"ESCUELA PEDRO DE VALDIVIA",null,"ESCUELA GENERAL RENE ESCAURIAZA",null,null,null,null,null,null,"ESCUELA BASICA DIEGO BARROS ARANA",null,"ESCUELA MUNICIPAL",null,null,null,null,null,null,null,null,"ESCUELA VICTOR DOMINGO SILVA","ESCUELA PORVENIR DE CATO",null,"ESCUELA PANIMAVIDA",null,"ESCUELA CAMINO ALTO",null,"ESCUELA MUNICIPAL JOSEFINA VIAL DE VIAL",null,"ESCUELA BASICA AGUA DE LA GLORIA","ESCUELA ESP. HUMBERTO ARANDA IRRIBARREN",null,"MAESTRA M.FRESIA HORMAZABAL LETELIER",null,"ESCUELA FUNDICION PAIPOTE","ESCUELA COQUIMBO","ESCUELA FRANCISCO COLOANE",null,null,null,null,null,"ESCUELA SAN JOSE DE COLICO",null,null,"ESCUELA EL MAITEN",null,null,"LICEO TIUQUILEMU",null,"ESCUELA REPUBLICA DE COSTA RICA","ESCUELA BASICA VILLA SANTA ELENA",null,null,null,null,null,null,"ESCUELA BASICA REPUBLICA DE FRANCIA",null,null,null,null,null,null,null,null,null,null,null,null,null,null,null,null,null,null,null,null,null,"ESCUELA EDUARDO LLANOS",null,null,null,null,null,null,"ESCUELA LAS ARAUCARIAS","ESCUELA DIFERENCIAL SANTA TERESITA DE LOS AND",null,null,"LICEO N523",null,"COLEGIO HEROES DE LA CONCEPCION","ESCUELA RURAL CATAMUTUN",null,null,"NORMA GONZ-LEZ GUERRA",null,null,null,"LICEO LOS CASTANOS","ESCUELA PROFESORA REBECA CASTRO ARANEDA",null,null,"ESCUELA MAITENES",null,"ESCUELA LAS VEGAS",null,null,"ESCUELA BASICA SANTA ADRIANA","ESCUELA POETA VICENTE HUIDOBRO",null,null,"ESCUELA GABRIELA MISTRAL",null,null,"ESCUELA JOHN KENNEDY","ESCUELA BASICA EL NOGAL.",null,null,null,null,"ESCUELA BASICA THOMPSON MATTHEWS",null,null,null,null,"ESCUELA GENERAL SAN MARTIN",null,null,null,null,null,null,null,null,null,"ESCUELA HUECHUN","ESCUELA SUPERIOR DE NINAS DE MOLINA","ESCUELA ESPERANZA DE HUANA",null,null,null,null,null,null,null,null,null,"ESCUELA JUAN XXIII",null,null,null,"ESCUELA LAGO RUPANCO","ESCUELA ALCONES BAJOS",null,"ESCUELA NIRRIMAPU",null,null,"ESCUELA CARMEN REVECO NUNEZ",null,null,"ESCUELA RURAL LAGO AZUL",null,null,null,"ESCUELA NIDER ORREGO QUEVEDO","ESCUELA SONIA PLAZA CASTRO","ESCUELA SANTA MARIA DE PENALOLEN","ESCUELA LO VALLEDOR",null,null,null,null,"ESCUELA PENCO",null,null,null,null,null,"ESCUELA MUNICIPAL DE SAN ROBERTO",null,null,null,null,null,null,null,null,null,null,"ESCUELA MULTIDEFICIT AMANECER",null,"ESCUELA ESTADO DE FLORIDA","ESCUELA LUIS MATTE LARRAIN","ESCUELA BASICA LICARAYEN",null,null,null,null,"ESCUELA HERNANDO DE MAGALLANES",null,null,null,"ESCUELA SAN ALBERTO",null,null,null,null,null,null,null,null,"ESCUELA PEDRO ENRIQUE TORRES SABELLE","ESCUELA CRISTINA DURAN","ESCUELA LOS MOLLES DE MARGA MARGA",null,null,"ESCUELA GIL DE CASTRO",null,null,"ESCUELA DUENDE MELODIA",null,null,"ESCUELA VICTOR CUCCUINI",null,"ESCUELA JUANA ATALA DE HIRMAS","COLEGIO MUNICIPAL VILLA DEL COBIL",null,"ESCUELA SANTA ISABEL",null,"ESCUELA RURAL TRAPI",null,null,null,null,null,null,null,null,"ESCUELA MATILDE SALAMANCA","ESCUELA MOVILIZADORES PORTUARIOS","ESCUELA CARDENAL ANTONIO SAMORE","ESCUELA GENERAL SOFANOR PARRA HERMOSILLA","ESCUELA DEIDAMIA PAREDES BELLO",null,null,"ESCUELA ESPECIAL SAGRADO CORAZON","ESCUELA BERNARDO MORENO FREDES",null,"LICEO MANUEL JESUS ORTIZ","ESCUELA MANUEL DE SALAS",null,null,null,null,null,null,null,null,"ESCUELA MIGUEL JOSE ZANARTU SANTA MARIA",null,"LICEO MUNICIPALIZADO ARAUCANIA",null,"ESCUELA ESPECIAL PAULA JARAQUEMADA",null,"ESCUELA MUNICIPAL DE LA PATAGUA",null,null,"ESCUELA BASICA REPUBLICA DE HAITI",null,null,null,"ESCUELA COSTANERA","ESCUELA BASICA CERRO CORNOU",null,"ESCUELA COLLIMALLIN","ESCUELA MORZA",null,null,null,null,null,null,"ESCUELA BASICA DICHATO",null,null,null,null,"ESCUELA ESPANA","ESCUELA GABRIELA MISTRAL","ESCUELA CARABINERO PEDRO A.CARIAGA M.",null,null,"ESCUELA NEFTALI REYES","ESCUELA BASICA JOHN KENNEDY",null,"ESCUELA TRINIDAD ALCAINO TAPIA","ESCUELA MANUEL MONTT"]
[3,"Falta información",null,null,null,null,null,null,null,null,null,null,null,null,null,7,null,null,null,"ANTOFAGASTA",null,null,null,null,null,null,null,"ESCUELA RURAL SOL DEL PACIFICO",null,null,"ESCUELA ECUADOR",null,"ESCUELA LOS PINOS","ESCUELA ESMERALDA","LICEO ALTO JAHUEL","ESCUELA LOS TILOS",null,null,"ESCUELA PILLANCO","ESCUELA BASICA RUBI NELSON SILVA SALAS","ESCUELA PARVULARIA LAS ARDILLAS","ESCUELA RURAL PUTENIO",null,"ESCUELA MONTE CARMELO",null,null,null,null,null,null,"ESCUELA TERESA DE LOS ANDES",null,"ESCUELA PORONGO",null,"ESCUELA HERMINDA DE LA VICTORIA",null,null,null,null,null,null,"ESCUELA BASICA EL TEJAR",null,"ESCUELA MUNICIPAL",null,null,null,null,null,null,null,null,"LICEO REPUBLICA ARGENTINA","ESCUELA TALQUIPEN",null,"ESCUELA RARI",null,"ESCUELA PREMIO NOBEL PABLO NERUDA",null,"ESCUELA MUNICIPAL OSVALDO RUIZ GARCIA",null,"ESCUELA BASICA FUNDO CHANCO","ESCUELA HORACIO JOHNSON GANA",null,null,null,"ESCUELA HERNAN MARQUEZ HUERTA","ESCUELA DE PENUELAS","ESCUELA JORGE ROJAS MIRANDA",null,null,null,null,null,"ESCUELA SANTA TERESA DE LOS ANDES",null,null,"ESCUELA ERNESTO CASTRO ARELLANO",null,null,null,null,"ESCUELA REPUBLICA DE FRANCIA","ESCUELA BERNARDO LEIGHTON",null,null,null,null,null,null,"ESCUELA BASICA UNION LATINOAMERICANA",null,null,null,null,null,null,null,null,null,null,null,null,null,null,null,null,null,null,null,null,null,"ESCUELA GABRIELA MISTRAL",null,null,null,null,null,null,"ESCUELA LAS LILAS","LICEO DOCTOR ALEJANDRO DEL RIO",null,null,"LICEO VICTOR JARA",null,"COLEGIO JAPON","ESCUELA RURAL CHOROICO",null,null,null,null,null,null,null,null,null,null,"ESCUELA MATIAS COUSINO",null,"ESCUELA NACIONES UNIDAS",null,null,"ESCUELA BLUE STAR COLLEGE","ESCUELA PROFESORA GLADYS VALENZUELA V",null,null,"ESCUELA JOSE MIGUEL CARRERA",null,null,"LICEO REPUBLICA ARGENTINA","ESCUELA BASICA LA AGUADA DE CUEL",null,null,null,null,"ESCUELA ISIDORA GOYENECHEA",null,null,null,null,"ESCUELA LAS AMERICAS",null,null,null,null,null,null,null,null,null,"ESCUELA JOSE CAMARENA ESCRIVA","LUIS MALDONADO BOGGIANO","ESCUELA HUATULAME",null,null,null,null,null,null,null,null,null,"ESCUELA REPUBLICA",null,null,null,"ESCUELA LEONILA FOLCH LOPEZ","ESCUELA ANTONIO TIRADO LANAS",null,"ESCUELA TROMEN",null,null,"ESCUELA DE HOSPITAL",null,null,"ESCUELA RURAL PULLINQUE",null,null,null,"ESCUELA SANTIAGO URRUTIA BENAVENTE","ESCUELA TERESA DE CALCUTA","ESCUELA TOBALABA","ESCUELA POETAS DE CHILE",null,null,null,null,"ESCUELA REPUBLICA DE ITALIA",null,null,null,null,null,"ESCUELA MUNICIPAL EL SALTO",null,null,null,null,null,null,null,null,null,null,null,null,"ESCUELA ESTRELLA DE CHILE","ESCUELA OSCAR BONILLA","ESCUELA BASICA SANTA INES",null,null,null,null,"ESCUELA JUAN WILLIAMS",null,null,null,"LICEO MANUEL MARIN",null,null,null,null,null,null,null,null,null,"ESCUELA ESPECIAL LOS PALTOS","ESCUELA LUIS CRUZ MARTINEZ",null,null,"ESCUELA INGLATERRA",null,null,"ESCUELA MUNICIPAL ALBERTO BLEST GANA",null,null,"LICEO ARTURO PEREZ CANTO",null,"ESCUELA JUANA DE LESTONAC","ESCUELA BASICA VICTOR NICOLETTI TAMANINI",null,null,null,"ESCUELA RURAL VALLE MANTILHUE BAJO",null,null,null,null,null,null,null,null,"ESCUELA TRANQUILLA","ESCUELA POETA HUIDOBRO","ESCUELA DE EDUCACION DIFERENCIAL","ESCUELA JOAQUIN DEL PINO ROZAS Y NEGRETE","ESCUELA EL COLORADO",null,null,"ESCUELA HERIBERTO BERMUDEZ CRUZ","ESCUELA CONCENTRAC. RURAL SERGIO VERDUGO HERRERA",null,null,"ESCUELA MANUEL RODRIGUEZ",null,null,null,null,null,null,null,null,null,null,null,null,"ESCUELA LAS PATAGUAS",null,"ESCUELA MUNICIPAL DE LENGUAJE SANTA CRUZ",null,null,"ESCUELA BASICA REPUBLICA DE MEXICO",null,null,null,"ESCUELA EL EDEN","ESCUELA BASICA CERRO SAN FRANCISCO",null,"ESCUELA DE PARVULOS CAMPANITA","ESCUELA PDTE CARLOS IBANEZ DEL CAMPO",null,null,null,null,null,null,"ESCUELA BASICA IGNACIO SERRANO MONTANER",null,null,null,null,"ESCUELA ESPECIAL WALTER SCHMIDT ROESTEL","ESCUELA GREGORIO CASTILLO MAR-N","ESCUELA DIEGO PORTALES PALAZUELOS",null,null,"ESCUELA RIOS DE ELQUI","ESCUELA BASICA LUISA NIETO DE HAMEL",null,null,"LICEO BICENTENARIO T+CNICO PROFESIONAL MARY GRAHAM"]
[4,"Falta información",null,null,null,null,null,null,null,null,null,null,null,null,null,8,null,null,null,"ANTUCO",null,null,null,null,null,null,null,"ESCUELA RURAL VILLA CHACAO",null,null,"ESCUELA EDDA CUNEO DONNAGIO",null,"ESCUELA VALLE ARAUCO","ESCUELA ESPAÑA","LICEO FRANCISCO JAVIER KRUGGER ALVARADO","ESCUELA MILAHUE",null,null,"ESCUELA QUINEL","ESCUELA BASICA TRES SAUCES",null,"ESCUELA RURAL QUETROLAUQUEN",null,null,null,null,null,null,null,null,null,null,"ESCUELA ROSITA OHIGGINS",null,"ESCUELA LEONARDO DA VINCI",null,null,null,null,null,null,"ESCUELA BASICA JOSE MARIA CARO RODRIGUEZ",null,"ESCUELA MUNICIPAL",null,null,null,null,null,null,null,null,null,null,null,null,null,null,null,"ESCUELA SUBTTE. ARTURO PEREZ CANTO",null,"ESCUELA BASICA LAGOS DE CHILE","ESCUELA PEDRO AGUIRRE CERDA",null,null,null,"ESCUELA ISABEL PENA MORALES","ESCUELA DE TAMBILLOS","ESCUELA JUAN JOSE LATORRE BENAVENTE",null,null,null,null,null,null,null,null,"ESCUELA ESPANA",null,null,null,null,"LICEO CARMELA SILVA DONOSO","ESCUELA CIUDAD DE LYON",null,null,null,null,null,null,"ESCUELA CARLOS CONDELL DE LA HAZA",null,null,null,null,null,null,null,null,null,null,null,null,null,null,null,null,null,null,null,null,null,"ESCUELA PAULA JARAQUEMADA ALQUIZAR",null,null,null,null,null,null,"ESCUELA LO CANAS","LICEO MALAQUIAS CONCHA",null,null,null,null,"COLEGIO JAVIERA CARRERA","ESCUELA RURAL CUINCO",null,null,null,null,null,null,null,null,null,null,"ESCUELA PRESIDENTE CARLOS IBANEZ DEL C.",null,null,null,null,"ESCUELA RAUL SAEZ SAEZ","ESCUELA SOR TERESA DE LOS ANDES",null,null,"ESCUELA JUAN SEGUNDO MUNOZ BRIONES",null,null,null,"ESCUELA BASICA LA CAPILLA",null,null,null,null,null,null,null,null,null,"ESCUELA LEON HUMBERTO VALENZUELA",null,null,null,null,null,null,null,null,null,"ESCUELA LIDIA MATTE HURTADO",null,"ESCUELA JUNTAS",null,null,null,null,null,null,null,null,null,null,null,null,null,"ESCUELA MEXICO DE MICHOACAN","ESCUELA ARTURO VILLALON SIEULANNE",null,"ESCUELA TRUF-TRUF.",null,null,"ESCUELA ELIAS SANCHEZ ORTUZAR",null,null,"ESCUELA RURAL REHUEICO",null,null,null,null,null,"ESCUELA UNION NACIONAL ARABE","ESCUELA VILLA SUR",null,null,null,null,"ESCUELA VIPLA",null,null,null,null,null,"ESCUELA REINO DE DINAMARCA",null,null,null,null,null,null,null,null,null,null,null,null,"ESCUELA LO BOZA","ESCUELA REPUBLICA DE GRECIA","ESCUELA BELLAVISTA",null,null,null,null,"ESCUELA LIBERTADOR CAP GRAL BDO OHIGGINS",null,null,null,"LICEO REPUBLICA DE ESTADOS UNIDOS",null,null,null,null,null,null,null,null,null,"ESCUELA NUESTRO MUNDO","ESCUELA MANUEL BULNES PRIETO",null,null,"ESCUELA INSIGNE GABRIELA",null,null,"ESCUELA MUNICIPAL AUGUSTO D HALMAR",null,null,null,null,"ESCUELA REBECA MATTE BELLO","ESCUELA CARLOS CONDELL DE LA HAZA",null,null,null,"ESCUELA RURAL VIVANCO",null,null,null,null,null,null,null,null,null,"ESCUELA POETA PABLO NERUDA","ESCUELA DIEGO PORTALES","ESCUELA JUNQUILLO","ESCUELA ENRIQUE CORREA GUZMAN",null,null,"ESCUELA JOHN F KENNEDY","ESCUELA JORGE MUNOZ SILVA",null,null,"ESCUELA PEDRO LAGOS",null,null,null,null,null,null,null,null,null,null,null,null,"ESCUELA MUNICIPAL CUCHIPUY",null,"ESCUELA MUNICIPAL DE LOS MAITENES",null,null,"ESCUELA BASICA REPUBLICA DE PANAMA",null,null,null,"ESCUELA EL ORIENTE","ESCUELA BASICA CRUZ DEL SUR",null,"ESCUELA DE PARVULOS SEMILLITA","ESCUELA SAN CRISTOBAL",null,null,null,null,null,null,"ESCUELA BASICA MENQUE",null,null,null,null,"ESCUELA FEDOR M.DOSTOIEVSKI","ESCUELA HERMANOS CARRERA","ESCUELA DR. ERNESTO QUIROZ WEBER",null,null,null,"ESCUELA BASICA REPUBLICA DEL ECUADOR",null,null,"WINDMILL COLLEGE"]
[5,"Falta información",null,null,null,null,null,null,null,null,null,null,null,null,null,9,null,null,null,"ARAUCO",null,null,null,null,null,null,null,"ESCUELA YERBAS BUENAS",null,null,"ESCUELA ELMO FUNEZ CARRIZO",null,"ESCUELA VALLE RAMADILLAS","ESCUELA GABRIELA MISTRAL",null,"LICEO SANTA CRUZ DE LARQUI",null,null,"ESCUELA SALTO EL LAJA","ESCUELA DE LENGUAJE BAMBI",null,"ESCUELA RURAL SAN JOSE",null,null,null,null,null,null,null,null,null,null,"LICEO ANTONIO VARAS",null,"ESCUELA MARIA LUISA BOMBAL",null,null,null,null,null,null,"ESCUELA BASICA JUAN MADRID AZOLA",null,"ESCUELA MUNICIPAL",null,null,null,null,null,null,null,null,null,null,null,null,null,null,null,null,null,"ESCUELA BASICA LAUTARO","ESCUELA SOL NACIENTE",null,null,null,"ESCUELA JESUS FERNANDEZ HIDALGO","ESCUELA GUILLERMO CERECEDA","ESCUELA MAULE",null,null,null,null,null,null,null,null,"ESCUELA ESPECIAL CURICO",null,null,null,null,"LICEO LENKA FRANULIC","ESCUELA CLAUDIO ARRAU LEON",null,null,null,null,null,null,"ESCUELA REPUBLICA DE AUSTRIA",null,null,null,null,null,null,null,null,null,null,null,null,null,null,null,null,null,null,null,null,null,"ESCUELA PLACIDO VILLARROEL",null,null,null,null,null,null,"ESCUELA LOS CEREZOS","LICEO MUNICIPAL LA GRANJA POETA NERUDA",null,null,null,null,"COLEGIO JOSE MANUEL BALMACEDA","ESCUELA RURAL LOS ESTEROS",null,null,null,null,null,null,null,null,null,null,"ESCUELA RAMON BELMAR SALDIAS",null,null,null,null,"LICEO POLIVALENTE","MUSTAFA KEMAL ATATURK",null,null,"ESCUELA LUIS PEREIRA INIGUEZ",null,null,null,"ESCUELA BASICA LA LEYENDA",null,null,null,null,null,null,null,null,null,"ESCUELA PRESIDENTE RIESCO ERRAZURIZ",null,null,null,null,null,null,null,null,null,"ESCUELA PADRE ALBERTO HURTADO",null,"ESCUELA SANTA BERNARDITA",null,null,null,null,null,null,null,null,null,null,null,null,null,"ESCUELA MONSEÑOR FRANCISCO VALDES SUBERCASEAUX","ESCUELA AURORA DE CHILE",null,"ESCUELA TRUMPULO CHICO",null,null,"ESCUELA HUGO PINO VILCHEZ",null,null,null,null,null,null,null,null,"LICEO ANTONIO HERMIDA FABRES","LICEO MUNICIPAL ENRIQUE BACKAUSSE",null,null,null,null,"LICEO RIOS DE CHILE",null,null,null,null,null,null,null,null,null,null,null,null,null,null,null,null,null,null,"ESCUELA MONSENOR CARLOS OVIEDO","ESCUELA VILLA INDEPENDENCIA","ESCUELA CAPITAN ARTURO PRAT CHACON",null,null,null,null,"ESCUELA PADRE ALBERTO HURTADO CRUCHAGA",null,null,null,null,null,null,null,null,null,null,null,null,null,null,"ESCUELA TENIENTE IGNACIO SERRANO MONTANER",null,null,"ESCUELA LO FRANCO",null,null,"ESCUELA MUNICIPAL CARLOS MIRANDA MIRANDA",null,null,null,null,"LICEO THOMAS ALVA EDISON","ESCUELA DIFERENCIAL TERESA NARETTO DE NICOLETTI",null,null,null,null,null,null,null,null,null,null,null,null,null,"ESCUELA PRE-BASICA PETER PAN","ESCUELA ELEODORO YANEZ PONCE DE LEON","ESCUELA LAS ARBOLEDAS","ESCUELA FLOR DEL LLANO",null,null,"ESCUELA JOS+ ANTONIO MANSO DE VELASCO","ESCUELA JOSE DE SAN MARTIN",null,null,"ESCUELA RAMON CARNICER",null,null,null,null,null,null,null,null,null,null,null,null,"ESCUELA MUNICIPAL EL NARANJAL",null,"ESCUELA MUNICIPAL DE MILLAHUE DE APALTA",null,null,"ESCUELA BASICA REYES CATOLICOS",null,null,null,"ESCUELA EL SAUCE","ESCUELA BASICA LA DAMA BLANCA",null,"ESCUELA ESPECIAL NIELOL","ESCUELA SAN RAFAEL",null,null,null,null,null,null,"ESCUELA BASICA MILLAHUE",null,null,null,null,"ESCUELA FERNANDO SANTIVAN","ESCUELA IGNACIO CARRERA PINTO","ESCUELA ELEUTERIO RAMIREZ",null,null,null,"ESCUELA BASICA REPUBLICA DEL LIBANO"]
[6,"Falta información",null,null,null,null,null,null,null,null,null,null,null,null,null,"K",null,null,null,"ARICA",null,null,null,null,null,null,null,null,null,null,"ESCUELA ESPANA",null,"LICEO T+CNICO PESQUERO FILIDOR GAETE MONS-LVEZ","ESCUELA GRAL JOSE MIGUEL CARRERA",null,null,null,null,null,"ESCUELA LEONCIO ARANEDA FIGUEROA",null,"ESCUELA RURAL SAN RAFAEL",null,null,null,null,null,null,null,null,null,null,null,null,"ESCUELA MILLAHUE",null,null,null,null,null,null,"ESCUELA BASICA LA CASTILLA",null,"ESCUELA MUNICIPAL",null,null,null,null,null,null,null,null,null,null,null,null,null,null,null,null,null,"ESCUELA BASICA RENE LOUVEL BERT","ESCUELA UNESCO",null,null,null,"ESCUELA JOSE MANSO DE VELASCO","ESCUELA JOSE ALFARO ALFARO","ESCUELA OCTAVIO SALINAS CARIAGA",null,null,null,null,null,null,null,null,"ESCUELA GRECIA",null,null,null,null,"LICEO REPUBLICA DE SIRIA","ESCUELA DIFERENCIAL PARA NINOS SORDOS",null,null,null,null,null,null,"LICEO ESTACION CENTRAL",null,null,null,null,null,null,null,null,null,null,null,null,null,null,null,null,null,null,null,null,null,"ESCUELA PROFESOR MANUEL CASTRO RAMOS",null,null,null,null,null,null,"ESCUELA MARCELA PAZ",null,null,null,null,null,"COLEGIO JOSE MIGUEL CARRERA","ESCUELA RURAL MASHUE",null,null,null,null,null,null,null,null,null,null,"ESCUELA REPUBLICA DE FRANCIA",null,null,null,null,"LICEO TENIENTE FRANCISCO MERY AGUIRRE",null,null,null,"ESCUELA MARCELA PAZ",null,null,null,"ESCUELA BASICA LA QUEBRADA",null,null,null,null,null,null,null,null,null,"ESCUELA TOMAS VARGAS",null,null,null,null,null,null,null,null,null,"ESCUELA PATRICIO LARRAIN GANDARILLAS",null,null,null,null,null,null,null,null,null,null,null,null,null,null,null,"ESCUELA N. 46 ITALIA","ESCUELA BÁSICA ARTURO ALESSANDRI PALMA",null,null,null,null,"ESCUELA LAS COLONIAS",null,null,null,null,null,null,null,null,null,"LICEO POLIVALENTE EUGENIO PEREIRA SALAS",null,null,null,null,null,null,null,null,null,null,null,null,null,null,null,null,null,null,null,null,null,null,null,"ESCUELA PUERTO FUTURO","ESCUELA VOLCAN SAN JOSE","ESCUELA CAYENEL",null,null,null,null,"ESCUELA PARVULARIA JOSH KEE",null,null,null,null,null,null,null,null,null,null,null,null,null,null,"ESCUELA THEODOR HEUSS",null,null,"ESCUELA MEMBRILLAR",null,null,"ESCUELA MUNICIPAL EL COBRE",null,null,null,null,null,"ESCUELA EL NARANJAL",null,null,null,null,null,null,null,null,null,null,null,null,null,"ESCUELA PRESIDENTE PEDRO AGUIRRE CERDA","ESCUELA ESCRITORA MARCELA PAZ","ESCUELA MANUEL ANTONIO CASTILLO VELASCO","ESCUELA LOS ALMENDROS",null,null,"ESCUELA JOSE BERNARDO SUAREZ","ESCUELA MARIA LUISA BOUCHON",null,null,null,null,null,null,null,null,null,null,null,null,null,null,null,"ESCUELA MUNICIPAL MILLAHUE",null,"ESCUELA MUNICIPAL DE PANIAHUE",null,null,"ESCUELA CADETE ARTURO PRAT CHACON",null,null,null,"ESCUELA ESPECIAL ESPANA","ESCUELA BASICA LAS HIGUERAS",null,"ESCUELA LABRANZA","ESCUELA SUSANA MONTES VELASCO",null,null,null,null,null,null,"ESCUELA BASICA PUNTA DE PARRA",null,null,null,null,"ESCUELA FRANCIA","ESCUELA JOSE CAROCA LAFLOR","ESCUELA ESPANA",null,null,null,"ESCUELA BASICA SANTA JULIA"]
[7,"Falta información",null,null,null,null,null,null,null,null,null,null,null,null,null,null,null,null,null,"BUIN",null,null,null,null,null,null,null,null,null,null,"ESCUELA FUNDACION MINERA ESCONDIDA",null,null,"ESCUELA GRAL. MANUEL BAQUEDANO",null,null,null,null,null,"ESCUELA RICARDO COLOMA DIAZ",null,null,null,null,null,null,null,null,null,null,null,null,null,null,"ESCUELA PROF. MANUEL GUERRERO CEBALLOS",null,null,null,null,null,null,"ESCUELA BASICA LAS CANOAS",null,"ESCUELA MUNICIPAL",null,null,null,null,null,null,null,null,null,null,null,null,null,null,null,null,null,"ESCUELA DIEGO PORTALES PALAZUELOS","ESCUELA VALLE DEL INCA",null,null,null,"ESCUELA LAS BRISAS","ESCUELA JUAN PABLO II","ESCUELA RAFAEL SOTOMAYOR BAEZA",null,null,null,null,null,null,null,null,"ESCUELA HOLANDA",null,null,null,null,null,"ESCUELA GENERAL ALBERTO A. BACHELET MARTINEZ",null,null,null,null,null,null,null,null,null,null,null,null,null,null,null,null,null,null,null,null,null,null,null,null,null,null,null,null,"ESCUELA THILDA PORTILLO OLIVARES",null,null,null,null,null,null,"ESCUELA OSCAR CASTRO",null,null,null,null,null,"COLEGIO LUIS BRAILLE","ESCUELA RURAL PUERTO NUEVO",null,null,null,null,null,null,null,null,null,null,"ESCUELA SALOMON SALMAN DABUD",null,null,null,null,null,null,null,null,"ESCUELA MARIA AMBROSIA TAPIA MENDEZ",null,null,null,"ESCUELA BASICA LAS QUINTAS",null,null,null,null,null,null,null,null,null,"ESCUELA VICENTE REYES PALAZUELOS",null,null,null,null,null,null,null,null,null,"ESCUELA PEDRO MARIN ALEMANY",null,null,null,null,null,null,null,null,null,null,null,null,null,null,null,"ESCUELA N.88 CANADA","ESCUELA BASICA BERNARDO OªHIGGINS RIQUELME",null,null,null,null,"ESCUELA SENDERO DE CULITRIN",null,null,null,null,null,null,null,null,null,null,null,null,null,null,null,null,null,null,null,null,null,null,null,null,null,null,null,null,null,null,null,null,null,"ESCUELA SAN DANIEL","LICEO MUNIC.ING.MILITAR JUAN MACKENA O.","ESCUELA CHILOE",null,null,null,null,"ESCUELA PEDRO PABLO LEMAITRE",null,null,null,null,null,null,null,null,null,null,null,null,null,null,"LICEO GASTRONOMIA Y TURISMO",null,null,"ESCUELA PLATON",null,null,"ESCUELA MUNICIPAL HERMANOS CARRERA",null,null,null,null,null,"ESCUELA FERNANDA AEDO FAUNDEZ",null,null,null,null,null,null,null,null,null,null,null,null,null,"ESCUELA VILLA LAS DUNAS","ESCUELA ESPANA","ESCUELA MILLAUQUEN","ESCUELA LOS MONTES",null,null,"ESCUELA JUAN GOMEZ MILLAS","ESCUELA OLEGARIO LAZO BAEZA",null,null,null,null,null,null,null,null,null,null,null,null,null,null,null,"ESCUELA MUNICIPAL RASTROJOS",null,"ESCUELA MUNICIPAL DE QUINAHUE",null,null,"ESCUELA DE PARV. PARQUE O'HIGGINS",null,null,null,"ESCUELA ESPERANZA","ESCUELA BASICA LIBERTAD",null,"ESCUELA LOS AVELLANOS","ESCUELA TENO",null,null,null,null,null,null,"ESCUELA BASICA RAFAEL",null,null,null,null,"ESCUELA LAS ANIMAS","ESCUELA LUIS CRUZ MARTINEZ","ESCUELA ESPECIAL DE LENGUAJE LIBERTADOR DE LA PATRIA BERNARDO O'HIGGINS",null,null,null,"ESCUELA CANAL BEAGLE"]
[8,{"$f":"IF(E16=\"No\",IF(COUNTBLANK(C16:L16)=0,\"Completo\",IF(COUNTBLANK(C16:L16)=10,\"\",\"Falta información\")),IF(E16=\"Si\",IF(COUNTBLANK(C16:L16)=4,\"Completo\",IF(COUNTBLANK(C16:L16)=10,\"\",\"Falta información\")),\"Falta información\"))","v":"Falta información"},null,null,null,null,null,null,null,null,null,null,null,null,null,"Si",null,null,null,"BULNES",null,null,null,null,null,null,null,null,null,null,"ESCUELA GABRIELA MISTRAL",null,null,"ESCUELA IGNACIO CARRERA PINTO",null,null,null,null,null,null,null,null,null,null,null,null,null,null,null,null,null,null,null,null,"ESCUELA PROVINCIA DE ARAUCO",null,null,null,null,null,null,"ESCUELA BASICA LOS HEROES",null,"ESCUELA MUNICIPAL",null,null,null,null,null,null,null,null,null,null,null,null,null,null,null,null,null,"ESCUELA ESPECIAL CHILE ESPAÑA","LICEO MUNC.ALMIRANTE GALVARINO RIVEROS",null,null,null,"ESCUELA LAS CANTERAS","ESCUELA LUCILA GODOY ALCAYAGA","ESCUELA REMIGIO CASTRO ABURTO",null,null,null,null,null,null,null,null,"ESCUELA INTERNADO POTRERO GRANDE",null,null,null,null,null,"ESCUELA MARCIAL MARTINEZ FERRARI",null,null,null,null,null,null,null,null,null,null,null,null,null,null,null,null,null,null,null,null,null,null,null,null,null,null,null,null,"LICEO BICENTENARIO DOMINGO SANTA MARIA DE IQQ.",null,null,null,null,null,null,"ESCUELA SOTERO DEL RIO",null,null,null,null,null,"COLEGIO MANUEL RODRIGUEZ","ESCUELA RURAL TRAIGUEN",null,null,null,null,null,null,null,null,null,null,"ESCUELA SAN ANTONIO",null,null,null,null,null,null,null,null,"ESCUELA ONOFRE VASQUEZ NORAMBUENA",null,null,null,"ESCUELA BASICA MILLANTU",null,null,null,null,null,null,null,null,null,"LICEO JOSE IGNACIO ZENTENO",null,null,null,null,null,null,null,null,null,"ESCUELA PUANGUE",null,null,null,null,null,null,null,null,null,null,null,null,null,null,null,"ESCUELA PARVULARIA `PEDRO AGUIRRE CERDA`","ESCUELA BASICA EL GUINDO",null,null,null,null,"LICEO MARIA CARVAJAL FUENZALIDA",null,null,null,null,null,null,null,null,null,null,null,null,null,null,null,null,null,null,null,null,null,null,null,null,null,null,null,null,null,null,null,null,null,"ESCUELA TENIENTE HERNAN MERINO CORREA","LICEO MUNICIPAL CHILOE","ESCUELA DIFERENCIAL `LOS EUCALIPTOS`",null,null,null,null,"ESCUELA PEDRO SARMIENTO DE GAMBOA",null,null,null,null,null,null,null,null,null,null,null,null,null,null,"LICEO TECNICO PROFESIONAL MANNHEIM",null,null,"ESCUELA REPUBLICA DE LA INDIA",null,null,"ESCUELA MUNICIPAL ISABEL RIQUELME",null,null,null,null,null,"ESCUELA GUSTAVO BISQUERTT S.",null,null,null,null,null,null,null,null,null,null,null,null,null,"PADRE ANDRE COINDRE","ESCUELA GENERAL RENE SCHNEIDER CHEREAU","ESCUELA MONTE BLANCO","ESCUELA PEUMO NEGRO",null,null,"ESCUELA MANUEL RODRIGUEZ ERDOIZA","ESCUELA SAN HERNAN",null,null,null,null,null,null,null,null,null,null,null,null,null,null,null,"ESCUELA MUNICIPAL TOQUIHUA",null,"ESCUELA MUNICIPAL DE RINCON DE YAQUIL",null,null,"ESCUELA DIFERENCIAL JUAN SANDOVAL C",null,null,null,"ESCUELA HUILQUILEMU","ESCUELA BASICA PENINSULA DE TUMBES",null,"ESCUELA LOS TRIGALES",null,null,null,null,null,null,null,"ESCUELA BASICA REPUBLICA DE PANAMA",null,null,null,null,"ESCUELA LEONARDO DA VINCI","ESCUELA REPUBLICA DE LOS E.E.U.U.","ESCUELA GASPAR CABRALES",null,null,null,"ESCUELA CARDENAL JOSE MARIA CARO"]
[9,"Falta información",null,null,null,null,null,null,null,null,null,null,null,null,null,"No",null,null,null,"CABILDO",null,null,null,null,null,null,null,null,null,null,"ESCUELA GENERAL MANUEL BAQUEDANO",null,null,"ESCUELA JORGE ALESSANDRI RODRIGUEZ",null,null,null,null,null,null,null,null,null,null,null,null,null,null,null,null,null,null,null,null,"ESCUELA REPUBLICA DE CROACIA",null,null,null,null,null,null,"ESCUELA BASICA QUILAMAPU",null,"ESCUELA MUNICIPAL",null,null,null,null,null,null,null,null,null,null,null,null,null,null,null,null,null,"ESCUELA ESTHER HUNNEUS DE CLARO","LICEO POETA FEDERICO GARCIA LORCA",null,null,null,"ESCUELA LAURA ROBLES SILVA","ESCUELA PADRE ALBERTO HURTADO CRUCHAGA","ESCUELA REPUBLICA DE FRANCIA",null,null,null,null,null,null,null,null,"ESCUELA ISLA DE MARCHANT",null,null,null,null,null,"ESCUELA NEMESIO ANTUNEZ",null,null,null,null,null,null,null,null,null,null,null,null,null,null,null,null,null,null,null,null,null,null,null,null,null,null,null,null,null,null,null,null,null,null,null,"LICEO ALTO CORDILLERA DE LA FLORIDA",null,null,null,null,null,"COLEGIO PEDRO AGUIRRE CERDA",null,null,null,null,null,null,null,null,null,null,null,"ESCUELA SAN VICTOR ALAMOS",null,null,null,null,null,null,null,null,"ESCUELA PAULA JARAQUEMADA",null,null,null,"ESCUELA BASICA REPUBLICA DE ALEMANIA",null,null,null,null,null,null,null,null,null,"LICEO REINO DE DINAMARCA",null,null,null,null,null,null,null,null,null,"ESCUELA RAMON NOGUERA PRIETO",null,null,null,null,null,null,null,null,null,null,null,null,null,null,null,"ESCUELA RURAL EMILIO SURBER SCHULZ","ESCUELA BASICA FLORENCIO ESPINOZA LOPEZ",null,null,null,null,null,null,null,null,null,null,null,null,null,null,null,null,null,null,null,null,null,null,null,null,null,null,null,null,null,null,null,null,null,null,null,null,null,null,"LICEO CIUDAD DE BRASILIA","LICEO SAN GERONIMO","ESCUELA LA COLINA",null,null,null,null,"ESCUELA PORTUGAL",null,null,null,null,null,null,null,null,null,null,null,null,null,null,null,null,null,null,null,null,"ESCUELA MUNICIPAL J.M. BALMACEDA",null,null,null,null,null,"ESCUELA LA ISLA EMMA ESCOBAR DE LAGOS",null,null,null,null,null,null,null,null,null,null,null,null,null,"PROFESOR PEDRO VIVEROS ORMENO","ESCUELA HARAS LOS CONDORES","ESCUELA NINQUIHUE","ESCUELA PUNTA DE DIAMANTE",null,null,"ESCUELA MATEO COKLJAT K","ESCUELA VILLA CENTINELA",null,null,null,null,null,null,null,null,null,null,null,null,null,null,null,"ESCUELA MUNICIPAL VINA TAGUA TAGUA",null,"ESCUELA MUNICIPAL DE SANTA CRUZ",null,null,"ESCUELA ESPECIAL SANTIAGO APOSTOL",null,null,null,"ESCUELA IN+S SYLVESTER DE ARTOZÓN","ESCUELA CORNETA CABRALES",null,"ESCUELA MANIO CHICO",null,null,null,null,null,null,null,"ESCUELA BASICA SAN CARLITOS",null,null,null,null,"ESCUELA MEXICO",null,"ESCUELA GRECIA",null,null,null,"ESCUELA DOCTOR ADRIANO MACHADO PARDO"]
[10,"Falta información",null,null,null,null,null,null,null,null,null,null,null,null,null,null,null,null,null,"CABO DE HORNOS",null,null,null,null,null,null,null,null,null,null,"ESCUELA GONZALEZ ECHEGOYEN",null,null,"ESCUELA MANUEL RODRIGUEZ ERDOYZA",null,null,null,null,null,null,null,null,null,null,null,null,null,null,null,null,null,null,null,null,"ESCUELA REPUBLICA DE ITALIA",null,null,null,null,null,null,"ESCUELA BASICA QUINCHAMALI",null,"ESCUELA MUNICIPAL",null,null,null,null,null,null,null,null,null,null,null,null,null,null,null,null,null,"ESCUELA LUIS ALFREDO MUÑOZ BURBOA","LICEO POLIV. ABDON CIFUENTES",null,null,null,"ESCUELA LOS ESTANDARTES","ESCUELA PRESIDENTE ANIBAL PINTO","ESCUELA ROSA MEDEL AGUILERA",null,null,null,null,null,null,null,null,"ESCUELA LA OBRA",null,null,null,null,null,"ESCUELA ORLANDO LETELIER",null,null,null,null,null,null,null,null,null,null,null,null,null,null,null,null,null,null,null,null,null,null,null,null,null,null,null,null,null,null,null,null,null,null,null,"LICEO ANDRES BELLO",null,null,null,null,null,"COLEGIO QUEBRADA DE TALCA",null,null,null,null,null,null,null,null,null,null,null,"ESCUELA SANTA BARBARA",null,null,null,null,null,null,null,null,"ESCUELA PEDRO ALESSANDRI VARGAS",null,null,null,"ESCUELA BASICA REPUBLICA DE ISRAEL",null,null,null,null,null,null,null,null,null,"LICEO SANTIAGO BUERAS Y AVARIA",null,null,null,null,null,null,null,null,null,"ESCUELA RAQUEL FERNANDEZ DE MORANDE",null,null,null,null,null,null,null,null,null,null,null,null,null,null,null,"ESCUELA RURAL LUZ Y SABER","ESCUELA BASICA HELENE LANG",null,null,null,null,null,null,null,null,null,null,null,null,null,null,null,null,null,null,null,null,null,null,null,null,null,null,null,null,null,null,null,null,null,null,null,null,null,null,"LICEO MONSENOR ENRIQUE ALVEAR",null,"ESCUELA LIBERTAD",null,null,null,null,"ESCUELA REPUBLICA ARGENTINA",null,null,null,null,null,null,null,null,null,null,null,null,null,null,null,null,null,null,null,null,"ESCUELA MUNICIPAL JEAN PIAGET",null,null,null,null,null,"ESCUELA LA PAZ",null,null,null,null,null,null,null,null,null,null,null,null,null,null,"ESCUELA ISABEL RIQUELME","ESCUELA RIBERA DE NUBLE","ESCUELA QUERI",null,null,"ESCUELA REPUBLICA ARGENTINA","ESCUELA WASHINGTON OMAR VENEGAS",null,null,null,null,null,null,null,null,null,null,null,null,null,null,null,"ESCUELA MUNICIPAL ZUNIGA",null,null,null,null,"ESCUELA FERNANDO ALESSANDRI RODRIGUEZ",null,null,null,"ESCUELA JOSE ABELARDO NUNEZ","ESCUELA D N¦ 475",null,"ESCUELA MANUEL RECABARREN",null,null,null,null,null,null,null,"ESCUELA BASICA VEGAS DE COLIUMO",null,null,null,null,"ESCUELA RURAL CAYUMAPU",null,"ESCUELA HERNAN OLGUIN",null,null,null,"ESCUELA DR. OSCAR MARIN SOCIAS"]
[11,"Falta información",null,null,null,null,null,null,null,null,null,null,null,null,null,null,null,null,null,"CABRERO",null,null,null,null,null,null,null,null,null,null,"ESCUELA HEROES DE LA CONCEPCION",null,null,"ESCUELA PAMPA ALGODONAL",null,null,null,null,null,null,null,null,null,null,null,null,null,null,null,null,null,null,null,null,"ESCUELA SARGENTO CANDELARIA",null,null,null,null,null,null,"ESCUELA BASICA REYES DE ESPANA",null,"ESCUELA MUNICIPAL",null,null,null,null,null,null,null,null,null,null,null,null,null,null,null,null,null,"ESCUELA OSCAR CASTRO ZUNIGA",null,null,null,null,"ESCUELA LUIS CRUZ MARTINEZ","ESCUELA REPUBLICA DE GRECIA","ESCUELA ROSA YANEZ RODRIGUEZ",null,null,null,null,null,null,null,null,"ESCUELA LOS CRISTALES",null,null,null,null,null,null,null,null,null,null,null,null,null,null,null,null,null,null,null,null,null,null,null,null,null,null,null,null,null,null,null,null,null,null,null,null,null,null,null,null,null,"LICEO INDIRA GANDHI",null,null,null,null,null,"COLEGIO VICTOR DOMINGO SILVA",null,null,null,null,null,null,null,null,null,null,null,"ESCUELA UNO ISABEL RIQUELME",null,null,null,null,null,null,null,null,"ESCUELA ROBERTO OPAZO GALVEZ",null,null,null,"ESCUELA BASICA SANTA CLARA DE CHACAYAL",null,null,null,null,null,null,null,null,null,"REPUBLICA DE GUATEMALA",null,null,null,null,null,null,null,null,null,"ESCUELA REPUBLICA DEL BRASIL",null,null,null,null,null,null,null,null,null,null,null,null,null,null,null,"ESCUELA RURAL PICHIL","ESCUELA BASICA JOSE TOMAS OVALLE B.",null,null,null,null,null,null,null,null,null,null,null,null,null,null,null,null,null,null,null,null,null,null,null,null,null,null,null,null,null,null,null,null,null,null,null,null,null,null,null,null,"ESCUELA MARCELA PAZ",null,null,null,null,"ESCUELA REPUBLICA DE CROACIA",null,null,null,null,null,null,null,null,null,null,null,null,null,null,null,null,null,null,null,null,"ESCUELA MUNICIPAL MANUEL RODRIGUEZ",null,null,null,null,null,"ESCUELA MARTA AVARIA SALVATIERRA",null,null,null,null,null,null,null,null,null,null,null,null,null,null,"ESCUELA JAVIERA CARRERA VERDUGO","ESCUELA TRES ESQUINAS","ESCUELA RAMADILLAS",null,null,"ESCUELA SAN RAFAEL",null,null,null,null,null,null,null,null,null,null,null,null,null,null,null,null,"INSTITUTO SAN VICENTE DE TAGUA TAGUA",null,null,null,null,"ESCUELA REPUBLICA DE ALEMANIA",null,null,null,"ESCUELA JUAN LUIS SANFUENTES","ESCUELA DE P-RVULOS SAN FRANCISCO",null,"ESCUELA MILLARAY",null,null,null,null,null,null,null,"ESCUELA BASICA Y ADULTOS CALIFORNIA",null,null,null,null,"ESCUELA RURAL HUELLELHUE",null,"ESCUELA JOAQUIN EDWARDS BELLO",null,null,null,"ESCUELA EDUARDO LEZANA PINCHEIRA"]
[12,"Falta información",null,null,null,null,null,null,null,null,null,null,null,null,null,null,null,null,null,"CAÑETE",null,null,null,null,null,null,null,null,null,null,"ESCUELA HUANCHACA",null,null,"ESCUELA REGIMIENTO RANCAGUA",null,null,null,null,null,null,null,null,null,null,null,null,null,null,null,null,null,null,null,null,null,null,null,null,null,null,null,"ESCUELA CAMILO HENRIQUEZ",null,"ESCUELA MUNICIPAL",null,null,null,null,null,null,null,null,null,null,null,null,null,null,null,null,null,"ESCUELA PALESTINA DE PALOMARES",null,null,null,null,"ESCUELA MANUEL RODRIGUEZ","ESCUELA SAN RAFAEL","ESCUELA ROSITA RENARD",null,null,null,null,null,null,null,null,"ESCUELA MARIA OLGA FIGUEROA LEYTON",null,null,null,null,null,null,null,null,null,null,null,null,null,null,null,null,null,null,null,null,null,null,null,null,null,null,null,null,null,null,null,null,null,null,null,null,null,null,null,null,null,"LICEO NUEVO AMANECER",null,null,null,null,null,"COLEGIO VILLA SAN BARTOLOME",null,null,null,null,null,null,null,null,null,null,null,"JANUARIO ESPINOSA",null,null,null,null,null,null,null,null,"LICEO LAURA URRUTIA BENAVENTE",null,null,null,"ESCUELA BASICA VIRQUENCO",null,null,null,null,null,null,null,null,null,null,null,null,null,null,null,null,null,null,null,"ESCUELA SAN JOSE DE LA VILLA",null,null,null,null,null,null,null,null,null,null,null,null,null,null,null,"ESCUELA RURAL WALTERIO MEYER RUSCA","ESCUELA BASICA LOS OLIVOS",null,null,null,null,null,null,null,null,null,null,null,null,null,null,null,null,null,null,null,null,null,null,null,null,null,null,null,null,null,null,null,null,null,null,null,null,null,null,null,null,"ESCUELA MIRASOL",null,null,null,null,"ESCUELA VILLA LAS NIEVES",null,null,null,null,null,null,null,null,null,null,null,null,null,null,null,null,null,null,null,null,"ESCUELA MUNICIPAL MARCELA PAZ",null,null,null,null,null,"ESCUELA REPUBLICA DE ALEMANIA",null,null,null,null,null,null,null,null,null,null,null,null,null,null,"ESCUELA JOSE NUEZ MARTIN","LICEO DIEGO PORTALES PALAZUELOS","ESCUELA SANTA ELENA",null,null,"LICEO BICENTENARIO CORDILLERA DE SAN FELIPE",null,null,null,null,null,null,null,null,null,null,null,null,null,null,null,null,null,null,null,null,null,"ESCUELA REPUBLICA DE ISRAEL",null,null,null,"ESCUELA LA FLORIDA","ESCUELA DE PARVULOS EL ARENAL",null,"ESCUELA MOLLULCO",null,null,null,null,null,null,null,"ESCUELA GABRIELA MISTRAL",null,null,null,null,"ESCUELA RURAL LOS MOLINOS",null,"ESCUELA JORGE ALESSANDRI RODRIGUEZ",null,null,null,"ESCUELA ENRIQUE CARDENAS RIVERA"]
[13,"Falta información",null,null,null,null,null,null,null,null,null,null,null,null,null,null,null,null,null,"CALAMA",null,null,null,null,null,null,null,null,null,null,"ESCUELA JOSE PAPIC RADNIC",null,null,"ESCUELA REPUBLICA DE ARGENTINA",null,null,null,null,null,null,null,null,null,null,null,null,null,null,null,null,null,null,null,null,null,null,null,null,null,null,null,"ESCUELA ESPECIAL LAS ACACIAS",null,null,null,null,null,null,null,null,null,null,null,null,null,null,null,null,null,null,null,"ESCUELA PARVULARIA BLANCA ESTELA",null,null,null,null,"ESCUELA PEDRO LEON GALLO","ESCUELA SANTO TOMAS DE AQUINO","ESCUELA VICTOR DOMINGO SILVA",null,null,null,null,null,null,null,null,"ESCUELA OSVALDO CORREA FUENZALIDA",null,null,null,null,null,null,null,null,null,null,null,null,null,null,null,null,null,null,null,null,null,null,null,null,null,null,null,null,null,null,null,null,null,null,null,null,null,null,null,null,null,"LICEO POLIVALENTE LOS ALMENDROS",null,null,null,null,null,"ESCUELA ALONSO DE ERCILLA",null,null,null,null,null,null,null,null,null,null,null,"JUAN MARTINEZ DE ROZAS",null,null,null,null,null,null,null,null,null,null,null,null,"ESCUELA BLANCO ENCALADA",null,null,null,null,null,null,null,null,null,null,null,null,null,null,null,null,null,null,null,"ESCUELA SANTA ROSA ESMERALDA",null,null,null,null,null,null,null,null,null,null,null,null,null,null,null,"ESCUELA SOCIEDAD DE SOCORRO DE SEÑORAS","ESCUELA BASICA LUCIA NUNEZ DE LA CUADRA",null,null,null,null,null,null,null,null,null,null,null,null,null,null,null,null,null,null,null,null,null,null,null,null,null,null,null,null,null,null,null,null,null,null,null,null,null,null,null,null,"ESCUELA N 10 ANGELMO",null,null,null,null,"LICEO JUAN BAUTISTA CONTARDI",null,null,null,null,null,null,null,null,null,null,null,null,null,null,null,null,null,null,null,null,"ESCUELA MUNICIPAL MARTA BRUNET",null,null,null,null,null,"ESCUELA SANTA TERESA DE AVILA",null,null,null,null,null,null,null,null,null,null,null,null,null,null,"ESCUELA L.GRAL. BERNARDO O¦HIGGINS","LICEO T+CNICO PROFESIONAL VIOLETA PARRA SANDOVAL",null,null,null,"LICEO DE NINAS CORINA URBINA",null,null,null,null,null,null,null,null,null,null,null,null,null,null,null,null,null,null,null,null,null,"LICEO REPUBLICA DE BRASIL",null,null,null,"ESCUELA LAS AMERICAS","ESCUELA F 500 HUERTOS FAMILIARES",null,"ESCUELA MUNICIPAL EL TRENCITO",null,null,null,null,null,null,null,"ESCUELA MARIANO EGANA",null,null,null,null,null,null,"ESCUELA JUAN DE SAAVEDRA",null,null,null,"ESCUELA ESPECIAL ADOLFO TANNENBAUM B."]
[14,"Falta información",null,null,null,null,null,null,null,null,null,null,null,null,null,null,null,null,null,"CALBUCO",null,null,null,null,null,null,null,null,null,null,"ESCUELA JUAN LOPEZ",null,null,"ESCUELA REPUBLICA DE FRANCIA",null,null,null,null,null,null,null,null,null,null,null,null,null,null,null,null,null,null,null,null,null,null,null,null,null,null,null,"ESCUELA GABRIELA MISTRAL",null,null,null,null,null,null,null,null,null,null,null,null,null,null,null,null,null,null,null,"LICEO DOMINGO SANTA MAR-A",null,null,null,null,"ESCUELA SAN PEDRO","ESCUELA TOMASA OLIVARES CAAMANO","ESCUELA VISTA HERMOSA",null,null,null,null,null,null,null,null,"ESCUELA PABLO NERUDA",null,null,null,null,null,null,null,null,null,null,null,null,null,null,null,null,null,null,null,null,null,null,null,null,null,null,null,null,null,null,null,null,null,null,null,null,null,null,null,null,null,null,null,null,null,null,null,"ESCUELA DE COLONIA ALFALFARES",null,null,null,null,null,null,null,null,null,null,null,"PEDRO AGUIRRE CERDA",null,null,null,null,null,null,null,null,null,null,null,null,"ESCUELA CLARA REBOLLEDO DE GODOY",null,null,null,null,null,null,null,null,null,null,null,null,null,null,null,null,null,null,null,"LICEO GABRIELA MISTRAL DE MELIPILLA",null,null,null,null,null,null,null,null,null,null,null,null,null,null,null,"ESCUELA SUIZA","ESCUELA BASICA OSCAR ARAYA MOLINA",null,null,null,null,null,null,null,null,null,null,null,null,null,null,null,null,null,null,null,null,null,null,null,null,null,null,null,null,null,null,null,null,null,null,null,null,null,null,null,null,"ESCUELA N 3 MELIPULLI",null,null,null,null,null,null,null,null,null,null,null,null,null,null,null,null,null,null,null,null,null,null,null,null,null,"ESCUELA MUNICIPAL MINERAL EL TENIENTE",null,null,null,null,null,"ESCUELA VICENTE HUIDOBRO",null,null,null,null,null,null,null,null,null,null,null,null,null,null,"ESCUELA MAHUIDA",null,null,null,null,"LICEO SAN FELIPE",null,null,null,null,null,null,null,null,null,null,null,null,null,null,null,null,null,null,null,null,null,"MIGUEL DE CERVANTES Y SAAVEDRA ANEXO A-8",null,null,null,"ESCUELA PANGUILEMO","ESCUELA REPUBLICA BOLIVARIANA DE VENEZUELA",null,"ESCUELA PEDRO DE VALDIVIA",null,null,null,null,null,null,null,null,null,null,null,null,null,null,"ESCUELA JUAN JOSE LATORRE B",null,null,null,"ESCUELA ESPECIAL JUANITA DE AGUIRRE CERDA"]
[15,"Falta información",null,null,null,null,null,null,null,null,null,null,null,null,null,null,null,null,null,"CALDERA",null,null,null,null,null,null,null,null,null,null,"ESCUELA JUAN PABLO II",null,null,"ESCUELA REPUBLICA DE ISRAEL",null,null,null,null,null,null,null,null,null,null,null,null,null,null,null,null,null,null,null,null,null,null,null,null,null,null,null,"ESCUELA LOS JARDINES DE LAUTARO",null,null,null,null,null,null,null,null,null,null,null,null,null,null,null,null,null,null,null,"LICEO LUCERO GONZALEZ",null,null,null,null,"ESCUELA VICENTE SEPULVEDA ROJO",null,null,null,null,null,null,null,null,null,null,"ESCUELA PADRE ALBERTO HURTADO",null,null,null,null,null,null,null,null,null,null,null,null,null,null,null,null,null,null,null,null,null,null,null,null,null,null,null,null,null,null,null,null,null,null,null,null,null,null,null,null,null,null,null,null,null,null,null,"ESCUELA DE EL MILAGRO",null,null,null,null,null,null,null,null,null,null,null,null,null,null,null,null,null,null,null,null,null,null,null,null,"ESCUELA COLONIA ARABE",null,null,null,null,null,null,null,null,null,null,null,null,null,null,null,null,null,null,null,"LICEO POLIV. EL BOLLENAR",null,null,null,null,null,null,null,null,null,null,null,null,null,null,null,null,"ESCUELA BASICA VALENTIN LETELIER",null,null,null,null,null,null,null,null,null,null,null,null,null,null,null,null,null,null,null,null,null,null,null,null,null,null,null,null,null,null,null,null,null,null,null,null,null,null,null,null,"ESCUELA N 5 MIRAMAR",null,null,null,null,null,null,null,null,null,null,null,null,null,null,null,null,null,null,null,null,null,null,null,null,null,"ESCUELA MUNICIPAL PATRICIO MEKIS",null,null,null,null,null,null,null,null,null,null,null,null,null,null,null,null,null,null,null,null,"ESCUELA MANUEL MAGALLANES MOURE",null,null,null,null,null,null,null,null,null,null,null,null,null,null,null,null,null,null,null,null,null,null,null,null,null,null,null,null,null,null,"ESCUELA PROSPERIDAD","ESCUELA SANTA CLARA",null,"ESCUELA SANTA ROSA",null,null,null,null,null,null,null,null,null,null,null,null,null,null,"ESCUELA JUAN WACQUEZ MOURFIN",null,null,null,"ESCUELA GASTON OSSA SAINT MARIE"]
[16,"Falta información",null,null,null,null,null,null,null,null,null,null,null,null,null,null,null,null,null,"CALERA",null,null,null,null,null,null,null,null,null,null,"ESCUELA LA BANDERA",null,null,"ESCUELA RICARDO SILVA ARRIAGADA",null,null,null,null,null,null,null,null,null,null,null,null,null,null,null,null,null,null,null,null,null,null,null,null,null,null,null,"ESCUELA MARIA AMALIA SAAVEDRA MARTINEZ",null,null,null,null,null,null,null,null,null,null,null,null,null,null,null,null,null,null,null,"LICEO REBECA MATTE BELLO",null,null,null,null,null,null,null,null,null,null,null,null,null,null,null,"ESCUELA PALESTINA",null,null,null,null,null,null,null,null,null,null,null,null,null,null,null,null,null,null,null,null,null,null,null,null,null,null,null,null,null,null,null,null,null,null,null,null,null,null,null,null,null,null,null,null,null,null,null,"ESCUELA DE ISLON",null,null,null,null,null,null,null,null,null,null,null,null,null,null,null,null,null,null,null,null,null,null,null,null,"ESCUELA CORONEL GUILLERMO MARIN CARMONA",null,null,null,null,null,null,null,null,null,null,null,null,null,null,null,null,null,null,null,null,null,null,null,null,null,null,null,null,null,null,null,null,null,null,null,null,"ESCUELA BASICA VISTA HERMOSA",null,null,null,null,null,null,null,null,null,null,null,null,null,null,null,null,null,null,null,null,null,null,null,null,null,null,null,null,null,null,null,null,null,null,null,null,null,null,null,null,"ESCUELA N 7 ARABE-SIRIA",null,null,null,null,null,null,null,null,null,null,null,null,null,null,null,null,null,null,null,null,null,null,null,null,null,"ESCUELA MUNICIPAL RENE SCHNEIDER CHEREAU",null,null,null,null,null,null,null,null,null,null,null,null,null,null,null,null,null,null,null,null,"ESCUELA PART.COMANDANTE CARLOS CONDELL",null,null,null,null,null,null,null,null,null,null,null,null,null,null,null,null,null,null,null,null,null,null,null,null,null,null,null,null,null,null,"ESCUELA SAN MIGUEL","ESCUELA SANTA LEONOR",null,"ESCUELA STANDAR",null,null,null,null,null,null,null,null,null,null,null,null,null,null,"ESCUELA MONTEDONICO",null,null,null,"ESCUELA LA PARVA"]
[17,"Falta información",null,null,null,null,null,null,null,null,null,null,null,null,null,null,null,null,null,"CALERA DE TANGO",null,null,null,null,null,null,null,null,null,null,"ESCUELA LAS AMERICAS PROFESOR JUSTO VALLADARES ORELLANA",null,null,"ESCUELA ROMULO J. PENA MATURANA",null,null,null,null,null,null,null,null,null,null,null,null,null,null,null,null,null,null,null,null,null,null,null,null,null,null,null,"ESCUELA MARTA COLVIN ANDRADE",null,null,null,null,null,null,null,null,null,null,null,null,null,null,null,null,null,null,null,"LICEO REP+BLICA DE ISRAEL",null,null,null,null,null,null,null,null,null,null,null,null,null,null,null,"ESCUELA PRESIDENTE J.M.BALMACEDA",null,null,null,null,null,null,null,null,null,null,null,null,null,null,null,null,null,null,null,null,null,null,null,null,null,null,null,null,null,null,null,null,null,null,null,null,null,null,null,null,null,null,null,null,null,null,null,"ESCUELA DE LAMBERT",null,null,null,null,null,null,null,null,null,null,null,null,null,null,null,null,null,null,null,null,null,null,null,null,"ESCUELA DIEGO PORTALES PALAZUELOS",null,null,null,null,null,null,null,null,null,null,null,null,null,null,null,null,null,null,null,null,null,null,null,null,null,null,null,null,null,null,null,null,null,null,null,null,"ESCUELA CARACHILLA",null,null,null,null,null,null,null,null,null,null,null,null,null,null,null,null,null,null,null,null,null,null,null,null,null,null,null,null,null,null,null,null,null,null,null,null,null,null,null,null,"ESCUELA N¦2 REPUBLICA ARGENTINA",null,null,null,null,null,null,null,null,null,null,null,null,null,null,null,null,null,null,null,null,null,null,null,null,null,"ESCUELA MUNICIPAL VIRGINIA BRAVO",null,null,null,null,null,null,null,null,null,null,null,null,null,null,null,null,null,null,null,null,"ESCUELA REPUBLICA DE LOS EE.UU. DE AMERICA",null,null,null,null,null,null,null,null,null,null,null,null,null,null,null,null,null,null,null,null,null,null,null,null,null,null,null,null,null,null,"ESCUELA SANTA MARTA","ESCUELA VILLA CENTINELA SUR",null,"ESCUELA VILLA ALEGRE",null,null,null,null,null,null,null,null,null,null,null,null,null,null,"ESCUELA NACIONES UNIDAS",null,null,null,"ESCUELA LIBERTADOR BERNARDO O^HIGGINS"]
[18,"Falta información",null,null,null,null,null,null,null,null,null,null,null,null,null,null,null,null,null,"CALLE LARGA",null,null,null,null,null,null,null,null,null,null,"ESCUELA PADRE GUSTAVO LE PAIGE WALQUE",null,null,"ESCUELA SUBTTE. LUIS CRUZ MARTINEZ",null,null,null,null,null,null,null,null,null,null,null,null,null,null,null,null,null,null,null,null,null,null,null,null,null,null,null,"ESCUELA PALESTINA",null,null,null,null,null,null,null,null,null,null,null,null,null,null,null,null,null,null,null,"LICEO REP+BLICA DEL ECUADOR",null,null,null,null,null,null,null,null,null,null,null,null,null,null,null,"ESCUELA RAMON FREIRE",null,null,null,null,null,null,null,null,null,null,null,null,null,null,null,null,null,null,null,null,null,null,null,null,null,null,null,null,null,null,null,null,null,null,null,null,null,null,null,null,null,null,null,null,null,null,null,"ESCUELA DE LAS ROJAS",null,null,null,null,null,null,null,null,null,null,null,null,null,null,null,null,null,null,null,null,null,null,null,null,"ESCUELA GENERAL BERNARDO O HIGGINS",null,null,null,null,null,null,null,null,null,null,null,null,null,null,null,null,null,null,null,null,null,null,null,null,null,null,null,null,null,null,null,null,null,null,null,null,"ESCUELA CERRO TAMAYA",null,null,null,null,null,null,null,null,null,null,null,null,null,null,null,null,null,null,null,null,null,null,null,null,null,null,null,null,null,null,null,null,null,null,null,null,null,null,null,null,"ESCUELA NUEVA ALERCE",null,null,null,null,null,null,null,null,null,null,null,null,null,null,null,null,null,null,null,null,null,null,null,null,null,"LICEO INTEGRADO LIBERTADOR SIMÓN BOLIVAR",null,null,null,null,null,null,null,null,null,null,null,null,null,null,null,null,null,null,null,null,"ESCUELA REPUBLICA DEL BRASIL",null,null,null,null,null,null,null,null,null,null,null,null,null,null,null,null,null,null,null,null,null,null,null,null,null,null,null,null,null,null,"ESCUELA SARGENTO 2DO DANIEL REBOLLEDO","ESCUELA VILLA INDEPENDENCIA",null,"ESCUELA VILLA CAROLINA",null,null,null,null,null,null,null,null,null,null,null,null,null,null,"ESCUELA PACIFICO",null,null,null,"ESCUELA LORD COCHRANE"]
[19,{"$f":"IF(E27=\"No\",IF(COUNTBLANK(C27:L27)=0,\"Completo\",IF(COUNTBLANK(C27:L27)=10,\"\",\"Falta información\")),IF(E27=\"Si\",IF(COUNTBLANK(C27:L27)=4,\"Completo\",IF(COUNTBLANK(C27:L27)=10,\"\",\"Falta información\")),\"Falta información\"))","v":"Falta información"},null,null,null,null,null,null,null,null,null,null,null,null,null,null,null,null,null,"CANELA",null,null,null,null,null,null,null,null,null,null,"ESCUELA REPUBLICA ARGENTINA",null,null,"ESCUELA TUCAPEL",null,null,null,null,null,null,null,null,null,null,null,null,null,null,null,null,null,null,null,null,null,null,null,null,null,null,null,"ESCUELA PARVULARIA FEDERICO FROEBEL",null,null,null,null,null,null,null,null,null,null,null,null,null,null,null,null,null,null,null,null,null,null,null,null,null,null,null,null,null,null,null,null,null,null,null,"ESCUELA REPUBLICA ARGENTINA",null,null,null,null,null,null,null,null,null,null,null,null,null,null,null,null,null,null,null,null,null,null,null,null,null,null,null,null,null,null,null,null,null,null,null,null,null,null,null,null,null,null,null,null,null,null,null,"ESCUELA DE ROMERO",null,null,null,null,null,null,null,null,null,null,null,null,null,null,null,null,null,null,null,null,null,null,null,null,"ESCUELA GENERAL JOSE DE SAN MARTIN",null,null,null,null,null,null,null,null,null,null,null,null,null,null,null,null,null,null,null,null,null,null,null,null,null,null,null,null,null,null,null,null,null,null,null,null,"ESCUELA CHALINGA",null,null,null,null,null,null,null,null,null,null,null,null,null,null,null,null,null,null,null,null,null,null,null,null,null,null,null,null,null,null,null,null,null,null,null,null,null,null,null,null,"ESCUELA PABLO NERUDA",null,null,null,null,null,null,null,null,null,null,null,null,null,null,null,null,null,null,null,null,null,null,null,null,null,null,null,null,null,null,null,null,null,null,null,null,null,null,null,null,null,null,null,null,null,null,"ESCUELA REPUBLICA DEL PERU",null,null,null,null,null,null,null,null,null,null,null,null,null,null,null,null,null,null,null,null,null,null,null,null,null,null,null,null,null,null,"ESCUELA UNO SAN AGUSTIN","LICEO ANITA SERRANO SEPULVEDA",null,"JARDIN INFANTIL MONTE VERDE",null,null,null,null,null,null,null,null,null,null,null,null,null,null,"ESCUELA PILOTO 1¦ LUIS PARDO VILLALON",null,null,null,"ESCUELA MARCELA PAZ"]
[20,"Falta información",null,null,null,null,null,null,null,null,null,null,null,null,null,null,null,null,null,"CARAHUE",null,null,null,null,null,null,null,null,null,null,"ESCUELA REPUBLICA DE ITALIA",null,null,"LICEO AGRICOLA JOSE ABELARDO NUNEZ M.",null,null,null,null,null,null,null,null,null,null,null,null,null,null,null,null,null,null,null,null,null,null,null,null,null,null,null,"ESCUELA PAUL HARRIS",null,null,null,null,null,null,null,null,null,null,null,null,null,null,null,null,null,null,null,null,null,null,null,null,null,null,null,null,null,null,null,null,null,null,null,"ESCUELA REPUBLICA DE BRASIL",null,null,null,null,null,null,null,null,null,null,null,null,null,null,null,null,null,null,null,null,null,null,null,null,null,null,null,null,null,null,null,null,null,null,null,null,null,null,null,null,null,null,null,null,null,null,null,"ESCUELA DE SATURNO",null,null,null,null,null,null,null,null,null,null,null,null,null,null,null,null,null,null,null,null,null,null,null,null,"ESCUELA HOGAR NIEVES VASQUEZ PALACIOS",null,null,null,null,null,null,null,null,null,null,null,null,null,null,null,null,null,null,null,null,null,null,null,null,null,null,null,null,null,null,null,null,null,null,null,null,"ESCUELA EL CRISOL",null,null,null,null,null,null,null,null,null,null,null,null,null,null,null,null,null,null,null,null,null,null,null,null,null,null,null,null,null,null,null,null,null,null,null,null,null,null,null,null,"ESCUELA PADRE ALBERTO HURTADO",null,null,null,null,null,null,null,null,null,null,null,null,null,null,null,null,null,null,null,null,null,null,null,null,null,null,null,null,null,null,null,null,null,null,null,null,null,null,null,null,null,null,null,null,null,null,"ESCUELA STA. TERESA DE LOS MORROS",null,null,null,null,null,null,null,null,null,null,null,null,null,null,null,null,null,null,null,null,null,null,null,null,null,null,null,null,null,null,"ESCUELA VILLA CULENAR",null,null,"LICEO GABRIELA MISTRAL DE TEMUCO",null,null,null,null,null,null,null,null,null,null,null,null,null,null,"ESCUELA RAMON BARROS LUCO",null,null,null,"ESCUELA ORLANDO PENA CARVAJAL"]
[21,"Falta información",null,null,null,null,null,null,null,null,null,null,null,null,null,null,null,null,null,"CARTAGENA",null,null,null,null,null,null,null,null,null,null,"ESCUELA REPUBLICA DE LOS ESTADOS UNIDOS",null,null,"PARVULARIO LAS ESPIGUITAS",null,null,null,null,null,null,null,null,null,null,null,null,null,null,null,null,null,null,null,null,null,null,null,null,null,null,null,"ESCUELA RAMÓN VINAY SEP+LVEDA",null,null,null,null,null,null,null,null,null,null,null,null,null,null,null,null,null,null,null,null,null,null,null,null,null,null,null,null,null,null,null,null,null,null,null,"ESCUELA REPUBLICA DE ITALIA",null,null,null,null,null,null,null,null,null,null,null,null,null,null,null,null,null,null,null,null,null,null,null,null,null,null,null,null,null,null,null,null,null,null,null,null,null,null,null,null,null,null,null,null,null,null,null,"ESCUELA GERMAN RIESCO",null,null,null,null,null,null,null,null,null,null,null,null,null,null,null,null,null,null,null,null,null,null,null,null,"ESCUELA ISLA DE LAJA",null,null,null,null,null,null,null,null,null,null,null,null,null,null,null,null,null,null,null,null,null,null,null,null,null,null,null,null,null,null,null,null,null,null,null,null,"ESCUELA EL TRAPICHE",null,null,null,null,null,null,null,null,null,null,null,null,null,null,null,null,null,null,null,null,null,null,null,null,null,null,null,null,null,null,null,null,null,null,null,null,null,null,null,null,"ESCUELA ROTARIO PEDRO AVELINO BRAVO",null,null,null,null,null,null,null,null,null,null,null,null,null,null,null,null,null,null,null,null,null,null,null,null,null,null,null,null,null,null,null,null,null,null,null,null,null,null,null,null,null,null,null,null,null,null,"HERNAN MERINO CORREA",null,null,null,null,null,null,null,null,null,null,null,null,null,null,null,null,null,null,null,null,null,null,null,null,null,null,null,null,null,null,"ESCUELA VILLA LA PAZ",null,null,null,null,null,null,null,null,null,null,null,null,null,null,null,null,null,"ESCUELA REPUBLICA ARABE SIRIA",null,null,null,"ESCUELA PATRICIO LYNCH Z."]
[22,"Falta información",null,null,null,null,null,null,null,null,null,null,null,null,null,null,null,null,null,"CASABLANCA",null,null,null,null,null,null,null,null,null,null,"ESCUELA ROMULO J. PENA MATURANA",null,null,null,null,null,null,null,null,null,null,null,null,null,null,null,null,null,null,null,null,null,null,null,null,null,null,null,null,null,null,"ESCUELA REPUBLICA DE ISRAEL",null,null,null,null,null,null,null,null,null,null,null,null,null,null,null,null,null,null,null,null,null,null,null,null,null,null,null,null,null,null,null,null,null,null,null,"ESCUELA REPUBLICA ESTADOS UNIDOS",null,null,null,null,null,null,null,null,null,null,null,null,null,null,null,null,null,null,null,null,null,null,null,null,null,null,null,null,null,null,null,null,null,null,null,null,null,null,null,null,null,null,null,null,null,null,null,null,null,null,null,null,null,null,null,null,null,null,null,null,null,null,null,null,null,null,null,null,null,null,null,null,"ESCUELA PEDRO RUIZ ALDEA",null,null,null,null,null,null,null,null,null,null,null,null,null,null,null,null,null,null,null,null,null,null,null,null,null,null,null,null,null,null,null,null,null,null,null,null,"ESCUELA ELVIRA DEL CARMEN OCHOA AVILES",null,null,null,null,null,null,null,null,null,null,null,null,null,null,null,null,null,null,null,null,null,null,null,null,null,null,null,null,null,null,null,null,null,null,null,null,null,null,null,null,"ESCUELA RURAL ÀPUNTILLA TENGLO",null,null,null,null,null,null,null,null,null,null,null,null,null,null,null,null,null,null,null,null,null,null,null,null,null,null,null,null,null,null,null,null,null,null,null,null,null,null,null,null,null,null,null,null,null,null,"LICEO CLARA SOLOVERA",null,null,null,null,null,null,null,null,null,null,null,null,null,null,null,null,null,null,null,null,null,null,null,null,null,null,null,null,null,null,"ESCUELA VINA PURISIMA",null,null,null,null,null,null,null,null,null,null,null,null,null,null,null,null,null,"ESCUELA REPUBLICA ARGENTINA",null,null,null,"ESCUELA PAUL HARRIS"]
[23,"Falta información",null,null,null,null,null,null,null,null,null,null,null,null,null,null,null,null,null,"CASTRO",null,null,null,null,null,null,null,null,null,null,"ESCUELA SANTIAGO AMENGUAL B.",null,null,null,null,null,null,null,null,null,null,null,null,null,null,null,null,null,null,null,null,null,null,null,null,null,null,null,null,null,null,"ESCUELA REPUBLICA DE ITALIA",null,null,null,null,null,null,null,null,null,null,null,null,null,null,null,null,null,null,null,null,null,null,null,null,null,null,null,null,null,null,null,null,null,null,null,"ESCUELA SAN ANTONIO",null,null,null,null,null,null,null,null,null,null,null,null,null,null,null,null,null,null,null,null,null,null,null,null,null,null,null,null,null,null,null,null,null,null,null,null,null,null,null,null,null,null,null,null,null,null,null,null,null,null,null,null,null,null,null,null,null,null,null,null,null,null,null,null,null,null,null,null,null,null,null,null,"ESCUELA REPUBLICA DE GRECIA",null,null,null,null,null,null,null,null,null,null,null,null,null,null,null,null,null,null,null,null,null,null,null,null,null,null,null,null,null,null,null,null,null,null,null,null,"ESCUELA GUARDIAMARINA ERNESTO RIQUELME V",null,null,null,null,null,null,null,null,null,null,null,null,null,null,null,null,null,null,null,null,null,null,null,null,null,null,null,null,null,null,null,null,null,null,null,null,null,null,null,null,"ESCUELA RURAL CORRENTOSO",null,null,null,null,null,null,null,null,null,null,null,null,null,null,null,null,null,null,null,null,null,null,null,null,null,null,null,null,null,null,null,null,null,null,null,null,null,null,null,null,null,null,null,null,null,null,"LICEO NUEVO PORVENIR",null,null,null,null,null,null,null,null,null,null,null,null,null,null,null,null,null,null,null,null,null,null,null,null,null,null,null,null,null,null,"LICEO COMPLEJO EDUCACIONAL JAVIERA CARRERA",null,null,null,null,null,null,null,null,null,null,null,null,null,null,null,null,null,"ESCUELA REPUBLICA DE EL SALVADOR",null,null,null,"ESCUELA PEDRO AGUIRRE CERDA"]
[24,"Falta información",null,null,null,null,null,null,null,null,null,null,null,null,null,null,null,null,null,"CATEMU",null,null,null,null,null,null,null,null,null,null,"INSTITUTO CIENT-FICO EDUCACIONAL JOS+ MAZA SANCHO",null,null,null,null,null,null,null,null,null,null,null,null,null,null,null,null,null,null,null,null,null,null,null,null,null,null,null,null,null,null,"ESCUELA REPUBLICA DE MEXICO",null,null,null,null,null,null,null,null,null,null,null,null,null,null,null,null,null,null,null,null,null,null,null,null,null,null,null,null,null,null,null,null,null,null,null,"ESCUELA VICTOR VERGARA CAMPOS",null,null,null,null,null,null,null,null,null,null,null,null,null,null,null,null,null,null,null,null,null,null,null,null,null,null,null,null,null,null,null,null,null,null,null,null,null,null,null,null,null,null,null,null,null,null,null,null,null,null,null,null,null,null,null,null,null,null,null,null,null,null,null,null,null,null,null,null,null,null,null,null,"ESCUELA TENIENTE IGNACIO SERRANO",null,null,null,null,null,null,null,null,null,null,null,null,null,null,null,null,null,null,null,null,null,null,null,null,null,null,null,null,null,null,null,null,null,null,null,null,"ESCUELA LOS ACACIOS",null,null,null,null,null,null,null,null,null,null,null,null,null,null,null,null,null,null,null,null,null,null,null,null,null,null,null,null,null,null,null,null,null,null,null,null,null,null,null,null,"ESCUELA RURAL HUELMO",null,null,null,null,null,null,null,null,null,null,null,null,null,null,null,null,null,null,null,null,null,null,null,null,null,null,null,null,null,null,null,null,null,null,null,null,null,null,null,null,null,null,null,null,null,null,"LICEO VALLE DE LLUTA",null,null,null,null,null,null,null,null,null,null,null,null,null,null,null,null,null,null,null,null,null,null,null,null,null,null,null,null,null,null,"LORENZO VAROLI GHERARDI",null,null,null,null,null,null,null,null,null,null,null,null,null,null,null,null,null,"ESCUELA REPUBLICA DE ISRAEL",null,null,null,"ESCUELA PRESIDENTE EDUARDO FREI MONTALVA"]
[25,"Falta información",null,null,null,null,null,null,null,null,null,null,null,null,null,null,null,null,null,"CAUQUENES",null,null,null,null,null,null,null,null,null,null,"LICEO ANDRES SABELLA",null,null,null,null,null,null,null,null,null,null,null,null,null,null,null,null,null,null,null,null,null,null,null,null,null,null,null,null,null,null,"ESCUELA REPUBLICA DE PORTUGAL",null,null,null,null,null,null,null,null,null,null,null,null,null,null,null,null,null,null,null,null,null,null,null,null,null,null,null,null,null,null,null,null,null,null,null,null,null,null,null,null,null,null,null,null,null,null,null,null,null,null,null,null,null,null,null,null,null,null,null,null,null,null,null,null,null,null,null,null,null,null,null,null,null,null,null,null,null,null,null,null,null,null,null,null,null,null,null,null,null,null,null,null,null,null,null,null,null,null,null,null,null,null,null,null,null,null,null,null,"ESCUELA THOMAS JEFFERSON",null,null,null,null,null,null,null,null,null,null,null,null,null,null,null,null,null,null,null,null,null,null,null,null,null,null,null,null,null,null,null,null,null,null,null,null,"ESCUELA LOS NOGALES",null,null,null,null,null,null,null,null,null,null,null,null,null,null,null,null,null,null,null,null,null,null,null,null,null,null,null,null,null,null,null,null,null,null,null,null,null,null,null,null,"ESCUELA RURAL LA CHAMIZA",null,null,null,null,null,null,null,null,null,null,null,null,null,null,null,null,null,null,null,null,null,null,null,null,null,null,null,null,null,null,null,null,null,null,null,null,null,null,null,null,null,null,null,null,null,null,null,null,null,null,null,null,null,null,null,null,null,null,null,null,null,null,null,null,null,null,null,null,null,null,null,null,null,null,null,null,null,null,null,null,null,null,null,null,null,null,null,null,null,null,null,null,null,null,null,"ESCUELA REPUBLICA DE MEXICO",null,null,null,"ESCUELA PRESIDENTE JOSE MANUEL BALMACEDA"]
[26,"Falta información",null,null,null,null,null,null,null,null,null,null,null,null,null,null,null,null,null,"CERRILLOS",null,null,null,null,null,null,null,null,null,null,"LICEO DE HOMBRES DE ANTOFAGASTA MARIO BAHAMONDE SILVA",null,null,null,null,null,null,null,null,null,null,null,null,null,null,null,null,null,null,null,null,null,null,null,null,null,null,null,null,null,null,"LICEO LIBERTADOR BERNARDO O`HIGGINS RIQUELME",null,null,null,null,null,null,null,null,null,null,null,null,null,null,null,null,null,null,null,null,null,null,null,null,null,null,null,null,null,null,null,null,null,null,null,null,null,null,null,null,null,null,null,null,null,null,null,null,null,null,null,null,null,null,null,null,null,null,null,null,null,null,null,null,null,null,null,null,null,null,null,null,null,null,null,null,null,null,null,null,null,null,null,null,null,null,null,null,null,null,null,null,null,null,null,null,null,null,null,null,null,null,null,null,null,null,null,null,"LICEO AGROINDUSTRIAL LLANO BLANCO",null,null,null,null,null,null,null,null,null,null,null,null,null,null,null,null,null,null,null,null,null,null,null,null,null,null,null,null,null,null,null,null,null,null,null,null,"ESCUELA MARCOS MACUADA OGALDE",null,null,null,null,null,null,null,null,null,null,null,null,null,null,null,null,null,null,null,null,null,null,null,null,null,null,null,null,null,null,null,null,null,null,null,null,null,null,null,null,"ESCUELA RURAL LA PALOMA",null,null,null,null,null,null,null,null,null,null,null,null,null,null,null,null,null,null,null,null,null,null,null,null,null,null,null,null,null,null,null,null,null,null,null,null,null,null,null,null,null,null,null,null,null,null,null,null,null,null,null,null,null,null,null,null,null,null,null,null,null,null,null,null,null,null,null,null,null,null,null,null,null,null,null,null,null,null,null,null,null,null,null,null,null,null,null,null,null,null,null,null,null,null,null,"ESCUELA REPUBLICA DEL PARAGUAY",null,null,null,"ESCUELA PRESIDENTE SALVADOR ALLENDE"]
[27,"Falta información",null,null,null,null,null,null,null,null,null,null,null,null,null,null,null,null,null,"CERRO NAVIA",null,null,null,null,null,null,null,null,null,null,"LICEO MARTA NAREA DIAZ",null,null,null,null,null,null,null,null,null,null,null,null,null,null,null,null,null,null,null,null,null,null,null,null,null,null,null,null,null,null,null,null,null,null,null,null,null,null,null,null,null,null,null,null,null,null,null,null,null,null,null,null,null,null,null,null,null,null,null,null,null,null,null,null,null,null,null,null,null,null,null,null,null,null,null,null,null,null,null,null,null,null,null,null,null,null,null,null,null,null,null,null,null,null,null,null,null,null,null,null,null,null,null,null,null,null,null,null,null,null,null,null,null,null,null,null,null,null,null,null,null,null,null,null,null,null,null,null,null,null,null,null,null,null,null,null,null,null,null,"LICEO SANTA FE",null,null,null,null,null,null,null,null,null,null,null,null,null,null,null,null,null,null,null,null,null,null,null,null,null,null,null,null,null,null,null,null,null,null,null,null,"ESCUELA MARCOS RIGOBERTO PIZARRO ARAYA",null,null,null,null,null,null,null,null,null,null,null,null,null,null,null,null,null,null,null,null,null,null,null,null,null,null,null,null,null,null,null,null,null,null,null,null,null,null,null,null,"ESCUELA RURAL LA VARA",null,null,null,null,null,null,null,null,null,null,null,null,null,null,null,null,null,null,null,null,null,null,null,null,null,null,null,null,null,null,null,null,null,null,null,null,null,null,null,null,null,null,null,null,null,null,null,null,null,null,null,null,null,null,null,null,null,null,null,null,null,null,null,null,null,null,null,null,null,null,null,null,null,null,null,null,null,null,null,null,null,null,null,null,null,null,null,null,null,null,null,null,null,null,null,"ESCUELA REPUBLICA DEL URUGUAY",null,null,null,"ESCUELA SANTA MARIA DE AGUA SANTA"]
[28,"Falta información",null,null,null,null,null,null,null,null,null,null,null,null,null,null,null,null,null,"CHAÑARAL",null,null,null,null,null,null,null,null,null,null,"REVERENDO PADRE PATRICIO CARIOLA",null,null,null,null,null,null,null,null,null,null,null,null,null,null,null,null,null,null,null,null,null,null,null,null,null,null,null,null,null,null,null,null,null,null,null,null,null,null,null,null,null,null,null,null,null,null,null,null,null,null,null,null,null,null,null,null,null,null,null,null,null,null,null,null,null,null,null,null,null,null,null,null,null,null,null,null,null,null,null,null,null,null,null,null,null,null,null,null,null,null,null,null,null,null,null,null,null,null,null,null,null,null,null,null,null,null,null,null,null,null,null,null,null,null,null,null,null,null,null,null,null,null,null,null,null,null,null,null,null,null,null,null,null,null,null,null,null,null,null,null,null,null,null,null,null,null,null,null,null,null,null,null,null,null,null,null,null,null,null,null,null,null,null,null,null,null,null,null,null,null,null,null,null,null,null,null,"ESCUELA PADRE DAMIAN HEREDIA",null,null,null,null,null,null,null,null,null,null,null,null,null,null,null,null,null,null,null,null,null,null,null,null,null,null,null,null,null,null,null,null,null,null,null,null,null,null,null,null,"ESCUELA RURAL LAGUNITAS",null,null,null,null,null,null,null,null,null,null,null,null,null,null,null,null,null,null,null,null,null,null,null,null,null,null,null,null,null,null,null,null,null,null,null,null,null,null,null,null,null,null,null,null,null,null,null,null,null,null,null,null,null,null,null,null,null,null,null,null,null,null,null,null,null,null,null,null,null,null,null,null,null,null,null,null,null,null,null,null,null,null,null,null,null,null,null,null,null,null,null,null,null,null,null,"ESCUELA SAN JUDAS TADEO",null,null,null,"ESCUELA TEODORO LOWEY"]
[29,"Falta información",null,null,null,null,null,null,null,null,null,null,null,null,null,null,null,null,null,"CHAITEN",null,null,null,null,null,null,null,null,null,null,null,null,null,null,null,null,null,null,null,null,null,null,null,null,null,null,null,null,null,null,null,null,null,null,null,null,null,null,null,null,null,null,null,null,null,null,null,null,null,null,null,null,null,null,null,null,null,null,null,null,null,null,null,null,null,null,null,null,null,null,null,null,null,null,null,null,null,null,null,null,null,null,null,null,null,null,null,null,null,null,null,null,null,null,null,null,null,null,null,null,null,null,null,null,null,null,null,null,null,null,null,null,null,null,null,null,null,null,null,null,null,null,null,null,null,null,null,null,null,null,null,null,null,null,null,null,null,null,null,null,null,null,null,null,null,null,null,null,null,null,null,null,null,null,null,null,null,null,null,null,null,null,null,null,null,null,null,null,null,null,null,null,null,null,null,null,null,null,null,null,null,null,null,null,null,null,null,"ESCUELA PEDRO ENRIQUE ALFONSO BARRIOS",null,null,null,null,null,null,null,null,null,null,null,null,null,null,null,null,null,null,null,null,null,null,null,null,null,null,null,null,null,null,null,null,null,null,null,null,null,null,null,null,"ESCUELA RURAL LENCA",null,null,null,null,null,null,null,null,null,null,null,null,null,null,null,null,null,null,null,null,null,null,null,null,null,null,null,null,null,null,null,null,null,null,null,null,null,null,null,null,null,null,null,null,null,null,null,null,null,null,null,null,null,null,null,null,null,null,null,null,null,null,null,null,null,null,null,null,null,null,null,null,null,null,null,null,null,null,null,null,null,null,null,null,null,null,null,null,null,null,null,null,null,null,null,"ESCUELA VILLA BERLIN",null,null,null,"ESCUELA UNESCO"]
[30,"Falta información",null,null,null,null,null,null,null,null,null,null,null,null,null,null,null,null,null,"CHANCO",null,null,null,null,null,null,null,null,null,null,null,null,null,null,null,null,null,null,null,null,null,null,null,null,null,null,null,null,null,null,null,null,null,null,null,null,null,null,null,null,null,null,null,null,null,null,null,null,null,null,null,null,null,null,null,null,null,null,null,null,null,null,null,null,null,null,null,null,null,null,null,null,null,null,null,null,null,null,null,null,null,null,null,null,null,null,null,null,null,null,null,null,null,null,null,null,null,null,null,null,null,null,null,null,null,null,null,null,null,null,null,null,null,null,null,null,null,null,null,null,null,null,null,null,null,null,null,null,null,null,null,null,null,null,null,null,null,null,null,null,null,null,null,null,null,null,null,null,null,null,null,null,null,null,null,null,null,null,null,null,null,null,null,null,null,null,null,null,null,null,null,null,null,null,null,null,null,null,null,null,null,null,null,null,null,null,null,"ESCUELA TABALI",null,null,null,null,null,null,null,null,null,null,null,null,null,null,null,null,null,null,null,null,null,null,null,null,null,null,null,null,null,null,null,null,null,null,null,null,null,null,null,null,"ESCUELA RURAL MAILLEN",null,null,null,null,null,null,null,null,null,null,null,null,null,null,null,null,null,null,null,null,null,null,null,null,null,null,null,null,null,null,null,null,null,null,null,null,null,null,null,null,null,null,null,null,null,null,null,null,null,null,null,null,null,null,null,null,null,null,null,null,null,null,null,null,null,null,null,null,null,null,null,null,null,null,null,null,null,null,null,null,null,null,null,null,null,null,null,null,null,null,null,null,null,null,null,"LICEO DE NINAS MARIA FRANCK DE MACDOUGAL",null,null,null,"ESCUELA VILLA INDEPENDENCIA"]
[31,"Falta información",null,null,null,null,null,null,null,null,null,null,null,null,null,null,null,null,null,"CHEPICA",null,null,null,null,null,null,null,null,null,null,null,null,null,null,null,null,null,null,null,null,null,null,null,null,null,null,null,null,null,null,null,null,null,null,null,null,null,null,null,null,null,null,null,null,null,null,null,null,null,null,null,null,null,null,null,null,null,null,null,null,null,null,null,null,null,null,null,null,null,null,null,null,null,null,null,null,null,null,null,null,null,null,null,null,null,null,null,null,null,null,null,null,null,null,null,null,null,null,null,null,null,null,null,null,null,null,null,null,null,null,null,null,null,null,null,null,null,null,null,null,null,null,null,null,null,null,null,null,null,null,null,null,null,null,null,null,null,null,null,null,null,null,null,null,null,null,null,null,null,null,null,null,null,null,null,null,null,null,null,null,null,null,null,null,null,null,null,null,null,null,null,null,null,null,null,null,null,null,null,null,null,null,null,null,null,null,null,"ESCUELA UNION CAMPESINA",null,null,null,null,null,null,null,null,null,null,null,null,null,null,null,null,null,null,null,null,null,null,null,null,null,null,null,null,null,null,null,null,null,null,null,null,null,null,null,null,"ESCUELA RURAL MAILLEN-PUQUELDON",null,null,null,null,null,null,null,null,null,null,null,null,null,null,null,null,null,null,null,null,null,null,null,null,null,null,null,null,null,null,null,null,null,null,null,null,null,null,null,null,null,null,null,null,null,null,null,null,null,null,null,null,null,null,null,null,null,null,null,null,null,null,null,null,null,null,null,null,null,null,null,null,null,null,null,null,null,null,null,null,null,null,null,null,null,null,null,null,null,null,null,null,null,null,null,"LICEO MARIA LUISA BOMBAL",null,null,null,"ESCUELA VILLA MONTE"]
[32,"Falta información",null,null,null,null,null,null,null,null,null,null,null,null,null,null,null,null,null,"CHIGUAYANTE",null,null,null,null,null,null,null,null,null,null,null,null,null,null,null,null,null,null,null,null,null,null,null,null,null,null,null,null,null,null,null,null,null,null,null,null,null,null,null,null,null,null,null,null,null,null,null,null,null,null,null,null,null,null,null,null,null,null,null,null,null,null,null,null,null,null,null,null,null,null,null,null,null,null,null,null,null,null,null,null,null,null,null,null,null,null,null,null,null,null,null,null,null,null,null,null,null,null,null,null,null,null,null,null,null,null,null,null,null,null,null,null,null,null,null,null,null,null,null,null,null,null,null,null,null,null,null,null,null,null,null,null,null,null,null,null,null,null,null,null,null,null,null,null,null,null,null,null,null,null,null,null,null,null,null,null,null,null,null,null,null,null,null,null,null,null,null,null,null,null,null,null,null,null,null,null,null,null,null,null,null,null,null,null,null,null,null,null,null,null,null,null,null,null,null,null,null,null,null,null,null,null,null,null,null,null,null,null,null,null,null,null,null,null,null,null,null,null,null,null,null,null,null,null,null,null,null,null,"ESCUELA RURAL PELLUCO",null,null,null,null,null,null,null,null,null,null,null,null,null,null,null,null,null,null,null,null,null,null,null,null,null,null,null,null,null,null,null,null,null,null,null,null,null,null,null,null,null,null,null,null,null,null,null,null,null,null,null,null,null,null,null,null,null,null,null,null,null,null,null,null,null,null,null,null,null,null,null,null,null,null,null,null,null,null,null,null,null,null,null,null,null,null,null,null,null,null,null,null,null,null,null,"LICEO MATILDE BRANDAU DE ROSS",null,null,null,"ESCUELA VIOLETA PARRA"]
[33,"Falta información",null,null,null,null,null,null,null,null,null,null,null,null,null,null,null,null,null,"CHILE CHICO",null,null,null,null,null,null,null,null,null,null,null,null,null,null,null,null,null,null,null,null,null,null,null,null,null,null,null,null,null,null,null,null,null,null,null,null,null,null,null,null,null,null,null,null,null,null,null,null,null,null,null,null,null,null,null,null,null,null,null,null,null,null,null,null,null,null,null,null,null,null,null,null,null,null,null,null,null,null,null,null,null,null,null,null,null,null,null,null,null,null,null,null,null,null,null,null,null,null,null,null,null,null,null,null,null,null,null,null,null,null,null,null,null,null,null,null,null,null,null,null,null,null,null,null,null,null,null,null,null,null,null,null,null,null,null,null,null,null,null,null,null,null,null,null,null,null,null,null,null,null,null,null,null,null,null,null,null,null,null,null,null,null,null,null,null,null,null,null,null,null,null,null,null,null,null,null,null,null,null,null,null,null,null,null,null,null,null,null,null,null,null,null,null,null,null,null,null,null,null,null,null,null,null,null,null,null,null,null,null,null,null,null,null,null,null,null,null,null,null,null,null,null,null,null,null,null,null,null,"ESCUELA RURAL TEPUAL",null,null,null,null,null,null,null,null,null,null,null,null,null,null,null,null,null,null,null,null,null,null,null,null,null,null,null,null,null,null,null,null,null,null,null,null,null,null,null,null,null,null,null,null,null,null,null,null,null,null,null,null,null,null,null,null,null,null,null,null,null,null,null,null,null,null,null,null,null,null,null,null,null,null,null,null,null,null,null,null,null,null,null,null,null,null,null,null,null,null,null,null,null,null,null,"LICEO TECNOLÓGICO ALFREDO NAZAR FERES",null,null,null,"INST.DEL DISCAP.VISUAL ANTONIO MOSQUETE"]
[34,"Falta información",null,null,null,null,null,null,null,null,null,null,null,null,null,null,null,null,null,"CHILLAN",null,null,null,null,null,null,null,null,null,null,null,null,null,null,null,null,null,null,null,null,null,null,null,null,null,null,null,null,null,null,null,null,null,null,null,null,null,null,null,null,null,null,null,null,null,null,null,null,null,null,null,null,null,null,null,null,null,null,null,null,null,null,null,null,null,null,null,null,null,null,null,null,null,null,null,null,null,null,null,null,null,null,null,null,null,null,null,null,null,null,null,null,null,null,null,null,null,null,null,null,null,null,null,null,null,null,null,null,null,null,null,null,null,null,null,null,null,null,null,null,null,null,null,null,null,null,null,null,null,null,null,null,null,null,null,null,null,null,null,null,null,null,null,null,null,null,null,null,null,null,null,null,null,null,null,null,null,null,null,null,null,null,null,null,null,null,null,null,null,null,null,null,null,null,null,null,null,null,null,null,null,null,null,null,null,null,null,null,null,null,null,null,null,null,null,null,null,null,null,null,null,null,null,null,null,null,null,null,null,null,null,null,null,null,null,null,null,null,null,null,null,null,null,null,null,null,null,null,"ESCUELA RURAL TRAPEN"]
[35,"Falta información",null,null,null,null,null,null,null,null,null,null,null,null,null,null,null,null,null,"CHILLAN VIEJO",null,null,null,null,null,null,null,null,null,null,null,null,null,null,null,null,null,null,null,null,null,null,null,null,null,null,null,null,null,null,null,null,null,null,null,null,null,null,null,null,null,null,null,null,null,null,null,null,null,null,null,null,null,null,null,null,null,null,null,null,null,null,null,null,null,null,null,null,null,null,null,null,null,null,null,null,null,null,null,null,null,null,null,null,null,null,null,null,null,null,null,null,null,null,null,null,null,null,null,null,null,null,null,null,null,null,null,null,null,null,null,null,null,null,null,null,null,null,null,null,null,null,null,null,null,null,null,null,null,null,null,null,null,null,null,null,null,null,null,null,null,null,null,null,null,null,null,null,null,null,null,null,null,null,null,null,null,null,null,null,null,null,null,null,null,null,null,null,null,null,null,null,null,null,null,null,null,null,null,null,null,null,null,null,null,null,null,null,null,null,null,null,null,null,null,null,null,null,null,null,null,null,null,null,null,null,null,null,null,null,null,null,null,null,null,null,null,null,null,null,null,null,null,null,null,null,null,null,"LICEO RURAL LAS QUEMAS"]
[36,"Falta información",null,null,null,null,null,null,null,null,null,null,null,null,null,null,null,null,null,"CHIMBARONGO",null,null,null,null,null,null,null,null,null,null,null,null,null,null,null,null,null,null,null,null,null,null,null,null,null,null,null,null,null,null,null,null,null,null,null,null,null,null,null,null,null,null,null,null,null,null,null,null,null,null,null,null,null,null,null,null,null,null,null,null,null,null,null,null,null,null,null,null,null,null,null,null,null,null,null,null,null,null,null,null,null,null,null,null,null,null,null,null,null,null,null,null,null,null,null,null,null,null,null,null,null,null,null,null,null,null,null,null,null,null,null,null,null,null,null,null,null,null,null,null,null,null,null,null,null,null,null,null,null,null,null,null,null,null,null,null,null,null,null,null,null,null,null,null,null,null,null,null,null,null,null,null,null,null,null,null,null,null,null,null,null,null,null,null,null,null,null,null,null,null,null,null,null,null,null,null,null,null,null,null,null,null,null,null,null,null,null,null,null,null,null,null,null,null,null,null,null,null,null,null,null,null,null,null,null,null,null,null,null,null,null,null,null,null,null,null,null,null,null,null,null,null,null,null,null,null,null,null,"LICEO RURAL PIEDRA AZUL"]
[37,"Falta información",null,null,null,null,null,null,null,null,null,null,null,null,null,null,null,null,null,"CHOLCHOL"]
[38,"Falta información",null,null,null,null,null,null,null,null,null,null,null,null,null,null,null,null,null,"CHONCHI"]
[39,"Falta información",null,null,null,null,null,null,null,null,null,null,null,null,null,null,null,null,null,"CISNES"]
[40,"Falta información",null,null,null,null,null,null,null,null,null,null,null,null,null,null,null,null,null,"COBQUECURA"]
[41,"Falta información",null,null,null,null,null,null,null,null,null,null,null,null,null,null,null,null,null,"COCHAMO"]
[42,"Falta información",null,null,null,null,null,null,null,null,null,null,null,null,null,null,null,null,null,"COCHRANE"]
[43,"Falta información",null,null,null,null,null,null,null,null,null,null,null,null,null,null,null,null,null,"CODEGUA"]
[44,"Falta información",null,null,null,null,null,null,null,null,null,null,null,null,null,null,null,null,null,"COELEMU"]
[45,"Falta información",null,null,null,null,null,null,null,null,null,null,null,null,null,null,null,null,null,"COIHAIQUE"]
[46,"Falta información",null,null,null,null,null,null,null,null,null,null,null,null,null,null,null,null,null,"COIHUECO"]
[47,"Falta información",null,null,null,null,null,null,null,null,null,null,null,null,null,null,null,null,null,"COINCO"]
[48,"Falta información",null,null,null,null,null,null,null,null,null,null,null,null,null,null,null,null,null,"COLBUN"]
[49,"Falta información",null,null,null,null,null,null,null,null,null,null,null,null,null,null,null,null,null,"COLCHANE"]
[50,"Falta información",null,null,null,null,null,null,null,null,null,null,null,null,null,null,null,null,null,"COLINA"]
[51,"Falta información",null,null,null,null,null,null,null,null,null,null,null,null,null,null,null,null,null,"COLLIPULLI"]
[52,"Falta información",null,null,null,null,null,null,null,null,null,null,null,null,null,null,null,null,null,"COLTAUCO"]
[53,"Falta información",null,null,null,null,null,null,null,null,null,null,null,null,null,null,null,null,null,"COMBARBALA"]
[54,"Falta información",null,null,null,null,null,null,null,null,null,null,null,null,null,null,null,null,null,"CONCEPCION"]
[55,"Falta información",null,null,null,null,null,null,null,null,null,null,null,null,null,null,null,null,null,"CONCHALI"]
[56,"Falta información",null,null,null,null,null,null,null,null,null,null,null,null,null,null,null,null,null,"CONCON"]
[57,"Falta información",null,null,null,null,null,null,null,null,null,null,null,null,null,null,null,null,null,"CONSTITUCION"]
[58,"Falta información",null,null,null,null,null,null,null,null,null,null,null,null,null,null,null,null,null,"CONTULMO"]
[59,"Falta información",null,null,null,null,null,null,null,null,null,null,null,null,null,null,null,null,null,"COPIAPO"]
[60,"Falta información",null,null,null,null,null,null,null,null,null,null,null,null,null,null,null,null,null,"COQUIMBO"]
[61,"Falta información",null,null,null,null,null,null,null,null,null,null,null,null,null,null,null,null,null,"CORONEL"]
[62,"Falta información",null,null,null,null,null,null,null,null,null,null,null,null,null,null,null,null,null,"CORRAL"]
[63,"Falta información",null,null,null,null,null,null,null,null,null,null,null,null,null,null,null,null,null,"CUNCO"]
[64,"Falta información",null,null,null,null,null,null,null,null,null,null,null,null,null,null,null,null,null,"CURACAUTIN"]
[65,"Falta información",null,null,null,null,null,null,null,null,null,null,null,null,null,null,null,null,null,"CURACAVI"]
[66,{"$f":"IF(E74=\"No\",IF(COUNTBLANK(C74:L74)=0,\"Completo\",IF(COUNTBLANK(C74:L74)=10,\"\",\"Falta información\")),IF(E74=\"Si\",IF(COUNTBLANK(C74:L74)=4,\"Completo\",IF(COUNTBLANK(C74:L74)=10,\"\",\"Falta información\")),\"Falta información\"))","v":"Falta información"},null,null,null,null,null,null,null,null,null,null,null,null,null,null,null,null,null,"CURACO DE VELEZ"]
[67,"Falta información",null,null,null,null,null,null,null,null,null,null,null,null,null,null,null,null,null,"CURANILAHUE"]
[68,"Falta información",null,null,null,null,null,null,null,null,null,null,null,null,null,null,null,null,null,"CURARREHUE"]
[69,"Falta información",null,null,null,null,null,null,null,null,null,null,null,null,null,null,null,null,null,"CUREPTO"]
[70,"Falta información",null,null,null,null,null,null,null,null,null,null,null,null,null,null,null,null,null,"CURICO"]
[71,"Falta información",null,null,null,null,null,null,null,null,null,null,null,null,null,null,null,null,null,"DALCAHUE"]
[72,"Falta información",null,null,null,null,null,null,null,null,null,null,null,null,null,null,null,null,null,"DIEGO DE ALMAGRO"]
[73,"Falta información",null,null,null,null,null,null,null,null,null,null,null,null,null,null,null,null,null,"ÑIQUEN"]
[74,"Falta información",null,null,null,null,null,null,null,null,null,null,null,null,null,null,null,null,null,"DOÑIHUE"]
[75,"Falta información",null,null,null,null,null,null,null,null,null,null,null,null,null,null,null,null,null,"ÑUÑOA"]
[76,"Falta información",null,null,null,null,null,null,null,null,null,null,null,null,null,null,null,null,null,"EL BOSQUE"]
[77,"Falta información",null,null,null,null,null,null,null,null,null,null,null,null,null,null,null,null,null,"EL CARMEN"]
[78,"Falta información",null,null,null,null,null,null,null,null,null,null,null,null,null,null,null,null,null,"EL MONTE"]
[79,"Falta información",null,null,null,null,null,null,null,null,null,null,null,null,null,null,null,null,null,"EL QUISCO"]
[80,"Falta información",null,null,null,null,null,null,null,null,null,null,null,null,null,null,null,null,null,"EL TABO"]
[81,"Falta información",null,null,null,null,null,null,null,null,null,null,null,null,null,null,null,null,null,"EMPEDRADO"]
[82,"Falta información",null,null,null,null,null,null,null,null,null,null,null,null,null,null,null,null,null,"ERCILLA"]
[83,"Falta información",null,null,null,null,null,null,null,null,null,null,null,null,null,null,null,null,null,"ESTACION CENTRAL"]
[84,"Falta información",null,null,null,null,null,null,null,null,null,null,null,null,null,null,null,null,null,"FLORIDA"]
[85,"Falta información",null,null,null,null,null,null,null,null,null,null,null,null,null,null,null,null,null,"FREIRE"]
[86,"Falta información",null,null,null,null,null,null,null,null,null,null,null,null,null,null,null,null,null,"FREIRINA"]
[87,"Falta información",null,null,null,null,null,null,null,null,null,null,null,null,null,null,null,null,null,"FRESIA"]
[88,"Falta información",null,null,null,null,null,null,null,null,null,null,null,null,null,null,null,null,null,"FRUTILLAR"]
[89,"Falta información",null,null,null,null,null,null,null,null,null,null,null,null,null,null,null,null,null,"FUTALEUFU"]
[90,"Falta información",null,null,null,null,null,null,null,null,null,null,null,null,null,null,null,null,null,"FUTRONO"]
[91,"Falta información",null,null,null,null,null,null,null,null,null,null,null,null,null,null,null,null,null,"GALVARINO"]
[92,"Falta información",null,null,null,null,null,null,null,null,null,null,null,null,null,null,null,null,null,"GORBEA"]
[93,"Falta información",null,null,null,null,null,null,null,null,null,null,null,null,null,null,null,null,null,"GRANEROS"]
[94,"Falta información",null,null,null,null,null,null,null,null,null,null,null,null,null,null,null,null,null,"GUAITECAS"]
[95,"Falta información",null,null,null,null,null,null,null,null,null,null,null,null,null,null,null,null,null,"HIJUELAS"]
[96,"Falta información",null,null,null,null,null,null,null,null,null,null,null,null,null,null,null,null,null,"HUALAÑE"]
[97,"Falta información",null,null,null,null,null,null,null,null,null,null,null,null,null,null,null,null,null,"HUALAIHUE"]
[98,"Falta información",null,null,null,null,null,null,null,null,null,null,null,null,null,null,null,null,null,"HUALPEN"]
[99,"Falta información",null,null,null,null,null,null,null,null,null,null,null,null,null,null,null,null,null,"HUALQUI"]
[100,"Falta información",null,null,null,null,null,null,null,null,null,null,null,null,null,null,null,null,null,"HUARA"]
[101,"Falta información",null,null,null,null,null,null,null,null,null,null,null,null,null,null,null,null,null,"HUASCO"]
[102,"Falta información",null,null,null,null,null,null,null,null,null,null,null,null,null,null,null,null,null,"HUECHURABA"]
[103,"Falta información",null,null,null,null,null,null,null,null,null,null,null,null,null,null,null,null,null,"ILLAPEL"]
[104,"Falta información",null,null,null,null,null,null,null,null,null,null,null,null,null,null,null,null,null,"INDEPENDENCIA"]
[105,"Falta información",null,null,null,null,null,null,null,null,null,null,null,null,null,null,null,null,null,"IQUIQUE"]
[106,"Falta información",null,null,null,null,null,null,null,null,null,null,null,null,null,null,null,null,null,"ISLA DE MAIPO"]
[107,"Falta información",null,null,null,null,null,null,null,null,null,null,null,null,null,null,null,null,null,"ISLA DE PASCUA"]
[108,"Falta información",null,null,null,null,null,null,null,null,null,null,null,null,null,null,null,null,null,"JUAN FERNANDEZ"]
[109,"Falta información",null,null,null,null,null,null,null,null,null,null,null,null,null,null,null,null,null,"LA CISTERNA"]
[110,"Falta información",null,null,null,null,null,null,null,null,null,null,null,null,null,null,null,null,null,"LA CRUZ"]
[111,"Falta información",null,null,null,null,null,null,null,null,null,null,null,null,null,null,null,null,null,"LA ESTRELLA"]
[112,"Falta información",null,null,null,null,null,null,null,null,null,null,null,null,null,null,null,null,null,"LA FLORIDA"]
[113,"Falta información",null,null,null,null,null,null,null,null,null,null,null,null,null,null,null,null,null,"LA GRANJA"]
[114,"Falta información",null,null,null,null,null,null,null,null,null,null,null,null,null,null,null,null,null,"LA HIGUERA"]
[115,"Falta información",null,null,null,null,null,null,null,null,null,null,null,null,null,null,null,null,null,"LA LIGUA"]
[116,"Falta información",null,null,null,null,null,null,null,null,null,null,null,null,null,null,null,null,null,"LA PINTANA"]
[117,"Falta información",null,null,null,null,null,null,null,null,null,null,null,null,null,null,null,null,null,"LA REINA"]
[118,"Falta información",null,null,null,null,null,null,null,null,null,null,null,null,null,null,null,null,null,"LA SERENA"]
[119,"Falta información",null,null,null,null,null,null,null,null,null,null,null,null,null,null,null,null,null,"LA UNION"]
[120,"Falta información",null,null,null,null,null,null,null,null,null,null,null,null,null,null,null,null,null,"LAGO RANCO"]
[121,"Falta información",null,null,null,null,null,null,null,null,null,null,null,null,null,null,null,null,null,"LAJA"]
[122,"Falta información",null,null,null,null,null,null,null,null,null,null,null,null,null,null,null,null,null,"LAMPA"]
[123,"Falta información",null,null,null,null,null,null,null,null,null,null,null,null,null,null,null,null,null,"LANCO"]
[124,"Falta información",null,null,null,null,null,null,null,null,null,null,null,null,null,null,null,null,null,"LAS CABRAS"]
[125,"Falta información",null,null,null,null,null,null,null,null,null,null,null,null,null,null,null,null,null,"LAS CONDES"]
[126,"Falta información",null,null,null,null,null,null,null,null,null,null,null,null,null,null,null,null,null,"LAUTARO"]
[127,"Falta información",null,null,null,null,null,null,null,null,null,null,null,null,null,null,null,null,null,"LEBU"]
[128,"Falta información",null,null,null,null,null,null,null,null,null,null,null,null,null,null,null,null,null,"LICANTEN"]
[129,"Falta información",null,null,null,null,null,null,null,null,null,null,null,null,null,null,null,null,null,"LIMACHE"]
[130,{"$f":"IF(E138=\"No\",IF(COUNTBLANK(C138:L138)=0,\"Completo\",IF(COUNTBLANK(C138:L138)=10,\"\",\"Falta información\")),IF(E138=\"Si\",IF(COUNTBLANK(C138:L138)=4,\"Completo\",IF(COUNTBLANK(C138:L138)=10,\"\",\"Falta información\")),\"Falta información\"))","v":"Falta información"},null,null,null,null,null,null,null,null,null,null,null,null,null,null,null,null,null,"LINARES"]
[131,"Falta información",null,null,null,null,null,null,null,null,null,null,null,null,null,null,null,null,null,"LITUECHE"]
[132,"Falta información",null,null,null,null,null,null,null,null,null,null,null,null,null,null,null,null,null,"LLAILLAY"]
[133,"Falta información",null,null,null,null,null,null,null,null,null,null,null,null,null,null,null,null,null,"LLANQUIHUE"]
[134,"Falta información",null,null,null,null,null,null,null,null,null,null,null,null,null,null,null,null,null,"LO BARNECHEA"]
[135,"Falta información",null,null,null,null,null,null,null,null,null,null,null,null,null,null,null,null,null,"LO ESPEJO"]
[136,"Falta información",null,null,null,null,null,null,null,null,null,null,null,null,null,null,null,null,null,"LO PRADO"]
[137,"Falta información",null,null,null,null,null,null,null,null,null,null,null,null,null,null,null,null,null,"LOLOL"]
[138,"Falta información",null,null,null,null,null,null,null,null,null,null,null,null,null,null,null,null,null,"LONCOCHE"]
[139,"Falta información",null,null,null,null,null,null,null,null,null,null,null,null,null,null,null,null,null,"LONGAVI"]
[140,"Falta información",null,null,null,null,null,null,null,null,null,null,null,null,null,null,null,null,null,"LONQUIMAY"]
[141,"Falta información",null,null,null,null,null,null,null,null,null,null,null,null,null,null,null,null,null,"LOS ALAMOS"]
[142,"Falta información",null,null,null,null,null,null,null,null,null,null,null,null,null,null,null,null,null,"LOS ANDES"]
[143,"Falta información",null,null,null,null,null,null,null,null,null,null,null,null,null,null,null,null,null,"LOS ANGELES"]
[144,"Falta información",null,null,null,null,null,null,null,null,null,null,null,null,null,null,null,null,null,"LOS LAGOS"]
[145,"Falta información",null,null,null,null,null,null,null,null,null,null,null,null,null,null,null,null,null,"LOS MUERMOS"]
[146,"Falta información",null,null,null,null,null,null,null,null,null,null,null,null,null,null,null,null,null,"LOS SAUCES"]
[147,"Falta información",null,null,null,null,null,null,null,null,null,null,null,null,null,null,null,null,null,"LOS VILOS"]
[148,"Falta información",null,null,null,null,null,null,null,null,null,null,null,null,null,null,null,null,null,"LOTA"]
[149,"Falta información",null,null,null,null,null,null,null,null,null,null,null,null,null,null,null,null,null,"LUMACO"]
[150,"Falta información",null,null,null,null,null,null,null,null,null,null,null,null,null,null,null,null,null,"MACHALI"]
[151,"Falta información",null,null,null,null,null,null,null,null,null,null,null,null,null,null,null,null,null,"MACUL"]
[152,"Falta información",null,null,null,null,null,null,null,null,null,null,null,null,null,null,null,null,null,"MAFIL"]
[153,"Falta información",null,null,null,null,null,null,null,null,null,null,null,null,null,null,null,null,null,"MAIPU"]
[154,"Falta información",null,null,null,null,null,null,null,null,null,null,null,null,null,null,null,null,null,"MALLOA"]
[155,"Falta información",null,null,null,null,null,null,null,null,null,null,null,null,null,null,null,null,null,"MARCHIHUE"]
[156,"Falta información",null,null,null,null,null,null,null,null,null,null,null,null,null,null,null,null,null,"MARIA ELENA"]
[157,"Falta información",null,null,null,null,null,null,null,null,null,null,null,null,null,null,null,null,null,"MARIA PINTO"]
[158,"Falta información",null,null,null,null,null,null,null,null,null,null,null,null,null,null,null,null,null,"MARIQUINA"]
[159,"Falta información",null,null,null,null,null,null,null,null,null,null,null,null,null,null,null,null,null,"MAULE"]
[160,"Falta información",null,null,null,null,null,null,null,null,null,null,null,null,null,null,null,null,null,"MAULLIN"]
[161,"Falta información",null,null,null,null,null,null,null,null,null,null,null,null,null,null,null,null,null,"MEJILLONES"]
[162,"Falta información",null,null,null,null,null,null,null,null,null,null,null,null,null,null,null,null,null,"MELIPEUCO"]
[163,"Falta información",null,null,null,null,null,null,null,null,null,null,null,null,null,null,null,null,null,"MELIPILLA"]
[164,"Falta información",null,null,null,null,null,null,null,null,null,null,null,null,null,null,null,null,null,"MOLINA"]
[165,"Falta información",null,null,null,null,null,null,null,null,null,null,null,null,null,null,null,null,null,"MONTE PATRIA"]
[166,"Falta información",null,null,null,null,null,null,null,null,null,null,null,null,null,null,null,null,null,"MOSTAZAL"]
[167,"Falta información",null,null,null,null,null,null,null,null,null,null,null,null,null,null,null,null,null,"MULCHEN"]
[168,"Falta información",null,null,null,null,null,null,null,null,null,null,null,null,null,null,null,null,null,"NACIMIENTO"]
[169,"Falta información",null,null,null,null,null,null,null,null,null,null,null,null,null,null,null,null,null,"NANCAGUA"]
[170,"Falta información",null,null,null,null,null,null,null,null,null,null,null,null,null,null,null,null,null,"NATALES"]
[171,"Falta información",null,null,null,null,null,null,null,null,null,null,null,null,null,null,null,null,null,"NAVIDAD"]
[172,"Falta información",null,null,null,null,null,null,null,null,null,null,null,null,null,null,null,null,null,"NEGRETE"]
[173,"Falta información",null,null,null,null,null,null,null,null,null,null,null,null,null,null,null,null,null,"NINHUE"]
[174,"Falta información",null,null,null,null,null,null,null,null,null,null,null,null,null,null,null,null,null,"NOGALES"]
[175,"Falta información",null,null,null,null,null,null,null,null,null,null,null,null,null,null,null,null,null,"NUEVA IMPERIAL"]
[176,"Falta información",null,null,null,null,null,null,null,null,null,null,null,null,null,null,null,null,null,"O'HIGGINS"]
[177,"Falta información",null,null,null,null,null,null,null,null,null,null,null,null,null,null,null,null,null,"OLIVAR"]
[178,"Falta información",null,null,null,null,null,null,null,null,null,null,null,null,null,null,null,null,null,"OLMUE"]
[179,"Falta información",null,null,null,null,null,null,null,null,null,null,null,null,null,null,null,null,null,"OSORNO"]
[180,"Falta información",null,null,null,null,null,null,null,null,null,null,null,null,null,null,null,null,null,"OVALLE"]
[181,"Falta información",null,null,null,null,null,null,null,null,null,null,null,null,null,null,null,null,null,"PADRE HURTADO"]
[182,"Falta información",null,null,null,null,null,null,null,null,null,null,null,null,null,null,null,null,null,"PADRE LAS CASAS"]
[183,"Falta información",null,null,null,null,null,null,null,null,null,null,null,null,null,null,null,null,null,"PAIGUANO"]
[184,"Falta información",null,null,null,null,null,null,null,null,null,null,null,null,null,null,null,null,null,"PAILLACO"]
[185,"Falta información",null,null,null,null,null,null,null,null,null,null,null,null,null,null,null,null,null,"PAINE"]
[186,"Falta información",null,null,null,null,null,null,null,null,null,null,null,null,null,null,null,null,null,"PALENA"]
[187,"Falta información",null,null,null,null,null,null,null,null,null,null,null,null,null,null,null,null,null,"PALMILLA"]
[188,"Falta información",null,null,null,null,null,null,null,null,null,null,null,null,null,null,null,null,null,"PANGUIPULLI"]
[189,"Falta información",null,null,null,null,null,null,null,null,null,null,null,null,null,null,null,null,null,"PANQUEHUE"]
[190,"Falta información",null,null,null,null,null,null,null,null,null,null,null,null,null,null,null,null,null,"PAPUDO"]
[191,"Falta información",null,null,null,null,null,null,null,null,null,null,null,null,null,null,null,null,null,"PAREDONES"]
[192,"Falta información",null,null,null,null,null,null,null,null,null,null,null,null,null,null,null,null,null,"PARRAL"]
[193,"Falta información",null,null,null,null,null,null,null,null,null,null,null,null,null,null,null,null,null,"PEÑAFLOR"]
[194,{"$f":"IF(E202=\"No\",IF(COUNTBLANK(C202:L202)=0,\"Completo\",IF(COUNTBLANK(C202:L202)=10,\"\",\"Falta información\")),IF(E202=\"Si\",IF(COUNTBLANK(C202:L202)=4,\"Completo\",IF(COUNTBLANK(C202:L202)=10,\"\",\"Falta información\")),\"Falta información\"))","v":"Falta información"},null,null,null,null,null,null,null,null,null,null,null,null,null,null,null,null,null,"PEÑALOLEN"]
[195,"Falta información",null,null,null,null,null,null,null,null,null,null,null,null,null,null,null,null,null,"PEDRO AGUIRRE CERDA"]
[196,"Falta información",null,null,null,null,null,null,null,null,null,null,null,null,null,null,null,null,null,"PELARCO"]
[197,"Falta información",null,null,null,null,null,null,null,null,null,null,null,null,null,null,null,null,null,"PELLUHUE"]
[198,"Falta información",null,null,null,null,null,null,null,null,null,null,null,null,null,null,null,null,null,"PEMUCO"]
[199,"Falta información",null,null,null,null,null,null,null,null,null,null,null,null,null,null,null,null,null,"PENCAHUE"]
[200,"Falta información",null,null,null,null,null,null,null,null,null,null,null,null,null,null,null,null,null,"PENCO"]
[201,"Falta información",null,null,null,null,null,null,null,null,null,null,null,null,null,null,null,null,null,"PERALILLO"]
[202,"Falta información",null,null,null,null,null,null,null,null,null,null,null,null,null,null,null,null,null,"PERQUENCO"]
[203,"Falta información",null,null,null,null,null,null,null,null,null,null,null,null,null,null,null,null,null,"PETORCA"]
[204,"Falta información",null,null,null,null,null,null,null,null,null,null,null,null,null,null,null,null,null,"PEUMO"]
[205,"Falta información",null,null,null,null,null,null,null,null,null,null,null,null,null,null,null,null,null,"PICA"]
[206,"Falta información",null,null,null,null,null,null,null,null,null,null,null,null,null,null,null,null,null,"PICHIDEGUA"]
[207,"Falta información",null,null,null,null,null,null,null,null,null,null,null,null,null,null,null,null,null,"PICHILEMU"]
[208,"Falta información",null,null,null,null,null,null,null,null,null,null,null,null,null,null,null,null,null,"PINTO"]
[209,"Falta información",null,null,null,null,null,null,null,null,null,null,null,null,null,null,null,null,null,"PIRQUE"]
[210,"Falta información",null,null,null,null,null,null,null,null,null,null,null,null,null,null,null,null,null,"PITRUFQUEN"]
[211,"Falta información",null,null,null,null,null,null,null,null,null,null,null,null,null,null,null,null,null,"PLACILLA"]
[212,"Falta información",null,null,null,null,null,null,null,null,null,null,null,null,null,null,null,null,null,"PORTEZUELO"]
[213,"Falta información",null,null,null,null,null,null,null,null,null,null,null,null,null,null,null,null,null,"PORVENIR"]
[214,"Falta información",null,null,null,null,null,null,null,null,null,null,null,null,null,null,null,null,null,"POZO ALMONTE"]
[215,"Falta información",null,null,null,null,null,null,null,null,null,null,null,null,null,null,null,null,null,"PRIMAVERA"]
[216,"Falta información",null,null,null,null,null,null,null,null,null,null,null,null,null,null,null,null,null,"PROVIDENCIA"]
[217,"Falta información",null,null,null,null,null,null,null,null,null,null,null,null,null,null,null,null,null,"PUCHUNCAVI"]
[218,"Falta información",null,null,null,null,null,null,null,null,null,null,null,null,null,null,null,null,null,"PUCON"]
[219,"Falta información",null,null,null,null,null,null,null,null,null,null,null,null,null,null,null,null,null,"PUDAHUEL"]
[220,"Falta información",null,null,null,null,null,null,null,null,null,null,null,null,null,null,null,null,null,"PUENTE ALTO"]
[221,"Falta información",null,null,null,null,null,null,null,null,null,null,null,null,null,null,null,null,null,"PUERTO MONTT"]
[222,"Falta información",null,null,null,null,null,null,null,null,null,null,null,null,null,null,null,null,null,"PUERTO OCTAY"]
[223,"Falta información",null,null,null,null,null,null,null,null,null,null,null,null,null,null,null,null,null,"PUERTO VARAS"]
[224,"Falta información",null,null,null,null,null,null,null,null,null,null,null,null,null,null,null,null,null,"PUMANQUE"]
[225,"Falta información",null,null,null,null,null,null,null,null,null,null,null,null,null,null,null,null,null,"PUNITAQUI"]
[226,"Falta información",null,null,null,null,null,null,null,null,null,null,null,null,null,null,null,null,null,"PUNTA ARENAS"]
[227,"Falta información",null,null,null,null,null,null,null,null,null,null,null,null,null,null,null,null,null,"PUQUELDON"]
[228,"Falta información",null,null,null,null,null,null,null,null,null,null,null,null,null,null,null,null,null,"PUREN"]
[229,"Falta información",null,null,null,null,null,null,null,null,null,null,null,null,null,null,null,null,null,"PURRANQUE"]
[230,"Falta información",null,null,null,null,null,null,null,null,null,null,null,null,null,null,null,null,null,"PUTAENDO"]
[231,"Falta información",null,null,null,null,null,null,null,null,null,null,null,null,null,null,null,null,null,"PUTRE"]
[232,"Falta información",null,null,null,null,null,null,null,null,null,null,null,null,null,null,null,null,null,"PUYEHUE"]
[233,"Falta información",null,null,null,null,null,null,null,null,null,null,null,null,null,null,null,null,null,"QUEILEN"]
[234,"Falta información",null,null,null,null,null,null,null,null,null,null,null,null,null,null,null,null,null,"QUELLON"]
[235,"Falta información",null,null,null,null,null,null,null,null,null,null,null,null,null,null,null,null,null,"QUEMCHI"]
[236,"Falta información",null,null,null,null,null,null,null,null,null,null,null,null,null,null,null,null,null,"QUILACO"]
[237,"Falta información",null,null,null,null,null,null,null,null,null,null,null,null,null,null,null,null,null,"QUILICURA"]
[238,"Falta información",null,null,null,null,null,null,null,null,null,null,null,null,null,null,null,null,null,"QUILLECO"]
[239,"Falta información",null,null,null,null,null,null,null,null,null,null,null,null,null,null,null,null,null,"QUILLON"]
[240,"Falta información",null,null,null,null,null,null,null,null,null,null,null,null,null,null,null,null,null,"QUILLOTA"]
[241,"Falta información",null,null,null,null,null,null,null,null,null,null,null,null,null,null,null,null,null,"QUILPUE"]
[242,"Falta información",null,null,null,null,null,null,null,null,null,null,null,null,null,null,null,null,null,"QUINCHAO"]
[243,"Falta información",null,null,null,null,null,null,null,null,null,null,null,null,null,null,null,null,null,"QUINTA DE TILCOCO"]
[244,"Falta información",null,null,null,null,null,null,null,null,null,null,null,null,null,null,null,null,null,"QUINTA NORMAL"]
[245,"Falta información",null,null,null,null,null,null,null,null,null,null,null,null,null,null,null,null,null,"QUINTERO"]
[246,"Falta información",null,null,null,null,null,null,null,null,null,null,null,null,null,null,null,null,null,"QUIRIHUE"]
[247,"Falta información",null,null,null,null,null,null,null,null,null,null,null,null,null,null,null,null,null,"RANCAGUA"]
[248,"Falta información",null,null,null,null,null,null,null,null,null,null,null,null,null,null,null,null,null,"RANQUIL"]
[249,"Falta información",null,null,null,null,null,null,null,null,null,null,null,null,null,null,null,null,null,"RAUCO"]
[250,"Falta información",null,null,null,null,null,null,null,null,null,null,null,null,null,null,null,null,null,"RECOLETA"]
[251,"Falta información",null,null,null,null,null,null,null,null,null,null,null,null,null,null,null,null,null,"RENAICO"]
[252,"Falta información",null,null,null,null,null,null,null,null,null,null,null,null,null,null,null,null,null,"RENCA"]
[253,"Falta información",null,null,null,null,null,null,null,null,null,null,null,null,null,null,null,null,null,"RENGO"]
[254,"Falta información",null,null,null,null,null,null,null,null,null,null,null,null,null,null,null,null,null,"REQUINOA"]
[255,"Falta información",null,null,null,null,null,null,null,null,null,null,null,null,null,null,null,null,null,"RETIRO"]
[256,"Falta información",null,null,null,null,null,null,null,null,null,null,null,null,null,null,null,null,null,"RINCONADA"]
[257,"Falta información",null,null,null,null,null,null,null,null,null,null,null,null,null,null,null,null,null,"RIO BUENO"]
[258,{"$f":"IF(E266=\"No\",IF(COUNTBLANK(C266:L266)=0,\"Completo\",IF(COUNTBLANK(C266:L266)=10,\"\",\"Falta información\")),IF(E266=\"Si\",IF(COUNTBLANK(C266:L266)=4,\"Completo\",IF(COUNTBLANK(C266:L266)=10,\"\",\"Falta información\")),\"Falta información\"))","v":"Falta información"},null,null,null,null,null,null,null,null,null,null,null,null,null,null,null,null,null,"RIO CLARO"]
[259,"Falta información",null,null,null,null,null,null,null,null,null,null,null,null,null,null,null,null,null,"RIO HURTADO"]
[260,"Falta información",null,null,null,null,null,null,null,null,null,null,null,null,null,null,null,null,null,"RIO IBAÑEZ"]
[261,"Falta información",null,null,null,null,null,null,null,null,null,null,null,null,null,null,null,null,null,"RIO NEGRO"]
[262,"Falta información",null,null,null,null,null,null,null,null,null,null,null,null,null,null,null,null,null,"RIO VERDE"]
[263,"Falta información",null,null,null,null,null,null,null,null,null,null,null,null,null,null,null,null,null,"ROMERAL"]
[264,"Falta información",null,null,null,null,null,null,null,null,null,null,null,null,null,null,null,null,null,"SAAVEDRA"]
[265,"Falta información",null,null,null,null,null,null,null,null,null,null,null,null,null,null,null,null,null,"SAGRADA FAMILIA"]
[266,"Falta información",null,null,null,null,null,null,null,null,null,null,null,null,null,null,null,null,null,"SALAMANCA"]
[267,"Falta información",null,null,null,null,null,null,null,null,null,null,null,null,null,null,null,null,null,"SAN ANTONIO"]
[268,"Falta información",null,null,null,null,null,null,null,null,null,null,null,null,null,null,null,null,null,"SAN BERNARDO"]
[269,"Falta información",null,null,null,null,null,null,null,null,null,null,null,null,null,null,null,null,null,"SAN CARLOS"]
[270,"Falta información",null,null,null,null,null,null,null,null,null,null,null,null,null,null,null,null,null,"SAN CLEMENTE"]
[271,"Falta información",null,null,null,null,null,null,null,null,null,null,null,null,null,null,null,null,null,"SAN ESTEBAN"]
[272,"Falta información",null,null,null,null,null,null,null,null,null,null,null,null,null,null,null,null,null,"SAN FABIAN"]
[273,"Falta información",null,null,null,null,null,null,null,null,null,null,null,null,null,null,null,null,null,"SAN FELIPE"]
[274,"Falta información",null,null,null,null,null,null,null,null,null,null,null,null,null,null,null,null,null,"SAN FERNANDO"]
[275,"Falta información",null,null,null,null,null,null,null,null,null,null,null,null,null,null,null,null,null,"SAN GREGORIO"]
[276,"Falta información",null,null,null,null,null,null,null,null,null,null,null,null,null,null,null,null,null,"SAN IGNACIO"]
[277,"Falta información",null,null,null,null,null,null,null,null,null,null,null,null,null,null,null,null,null,"SAN JAVIER"]
[278,"Falta información",null,null,null,null,null,null,null,null,null,null,null,null,null,null,null,null,null,"SAN JOAQUIN"]
[279,"Falta información",null,null,null,null,null,null,null,null,null,null,null,null,null,null,null,null,null,"SAN JOSE DE MAIPO"]
[280,"Falta información",null,null,null,null,null,null,null,null,null,null,null,null,null,null,null,null,null,"SAN JUAN DE LA COSTA"]
[281,"Falta información",null,null,null,null,null,null,null,null,null,null,null,null,null,null,null,null,null,"SAN MIGUEL"]
[282,"Falta información",null,null,null,null,null,null,null,null,null,null,null,null,null,null,null,null,null,"SAN NICOLAS"]
[283,"Falta información",null,null,null,null,null,null,null,null,null,null,null,null,null,null,null,null,null,"SAN PABLO"]
[284,"Falta información",null,null,null,null,null,null,null,null,null,null,null,null,null,null,null,null,null,"SAN PEDRO"]
[285,"Falta información",null,null,null,null,null,null,null,null,null,null,null,null,null,null,null,null,null,"SAN PEDRO DE ATACAMA"]
[286,"Falta información",null,null,null,null,null,null,null,null,null,null,null,null,null,null,null,null,null,"SAN PEDRO DE LA PAZ"]
[287,"Falta información",null,null,null,null,null,null,null,null,null,null,null,null,null,null,null,null,null,"SAN RAFAEL"]
[288,"Falta información",null,null,null,null,null,null,null,null,null,null,null,null,null,null,null,null,null,"SAN RAMON"]
[289,"Falta información",null,null,null,null,null,null,null,null,null,null,null,null,null,null,null,null,null,"SAN ROSENDO"]
[290,"Falta información",null,null,null,null,null,null,null,null,null,null,null,null,null,null,null,null,null,"SAN VICENTE"]
[291,"Falta información",null,null,null,null,null,null,null,null,null,null,null,null,null,null,null,null,null,"SANTA BARBARA"]
[292,"Falta información",null,null,null,null,null,null,null,null,null,null,null,null,null,null,null,null,null,"SANTA CRUZ"]
[293,"Falta información",null,null,null,null,null,null,null,null,null,null,null,null,null,null,null,null,null,"SANTA JUANA"]
[294,"Falta información",null,null,null,null,null,null,null,null,null,null,null,null,null,null,null,null,null,"SANTA MARIA"]
[295,"Falta información",null,null,null,null,null,null,null,null,null,null,null,null,null,null,null,null,null,"SANTIAGO"]
[296,"Falta información",null,null,null,null,null,null,null,null,null,null,null,null,null,null,null,null,null,"SANTO DOMINGO"]
[297,"Falta información",null,null,null,null,null,null,null,null,null,null,null,null,null,null,null,null,null,"SIERRA GORDA"]
[298,"Falta información",null,null,null,null,null,null,null,null,null,null,null,null,null,null,null,null,null,"TALAGANTE"]
[299,"Falta información",null,null,null,null,null,null,null,null,null,null,null,null,null,null,null,null,null,"TALCA"]
[300,"Falta información",null,null,null,null,null,null,null,null,null,null,null,null,null,null,null,null,null,"TALCAHUANO"]
[301,"Falta información",null,null,null,null,null,null,null,null,null,null,null,null,null,null,null,null,null,"TALTAL"]
[302,"Falta información",null,null,null,null,null,null,null,null,null,null,null,null,null,null,null,null,null,"TEMUCO"]
[303,"Falta información",null,null,null,null,null,null,null,null,null,null,null,null,null,null,null,null,null,"TENO"]
[304,"Falta información",null,null,null,null,null,null,null,null,null,null,null,null,null,null,null,null,null,"TEODORO SCHMIDT"]
[305,"Falta información",null,null,null,null,null,null,null,null,null,null,null,null,null,null,null,null,null,"TIERRA AMARILLA"]
[306,"Falta información",null,null,null,null,null,null,null,null,null,null,null,null,null,null,null,null,null,"TILTIL"]
[307,"Falta información",null,null,null,null,null,null,null,null,null,null,null,null,null,null,null,null,null,"TIRUA"]
[308,"Falta información",null,null,null,null,null,null,null,null,null,null,null,null,null,null,null,null,null,"TOCOPILLA"]
[309,"Falta información",null,null,null,null,null,null,null,null,null,null,null,null,null,null,null,null,null,"TOLTEN"]
[310,"Falta información",null,null,null,null,null,null,null,null,null,null,null,null,null,null,null,null,null,"TOME"]
[311,"Falta información",null,null,null,null,null,null,null,null,null,null,null,null,null,null,null,null,null,"TORTEL"]
[312,"Falta información",null,null,null,null,null,null,null,null,null,null,null,null,null,null,null,null,null,"TRAIGUEN"]
[313,"Falta información",null,null,null,null,null,null,null,null,null,null,null,null,null,null,null,null,null,"TREGUACO"]
[314,"Falta información",null,null,null,null,null,null,null,null,null,null,null,null,null,null,null,null,null,"TUCAPEL"]
[315,"Falta información",null,null,null,null,null,null,null,null,null,null,null,null,null,null,null,null,null,"VALDIVIA"]
[316,"Falta información",null,null,null,null,null,null,null,null,null,null,null,null,null,null,null,null,null,"VALLENAR"]
[317,"Falta información",null,null,null,null,null,null,null,null,null,null,null,null,null,null,null,null,null,"VALPARAISO"]
[318,"Falta información",null,null,null,null,null,null,null,null,null,null,null,null,null,null,null,null,null,"VICHUQUEN"]
[319,"Falta información",null,null,null,null,null,null,null,null,null,null,null,null,null,null,null,null,null,"VICTORIA"]
[320,"Falta información",null,null,null,null,null,null,null,null,null,null,null,null,null,null,null,null,null,"VICUÑA"]
[321,"Falta información",null,null,null,null,null,null,null,null,null,null,null,null,null,null,null,null,null,"VIÑA DEL MAR"]
[322,{"$f":"IF(E330=\"No\",IF(COUNTBLANK(C330:L330)=0,\"Completo\",IF(COUNTBLANK(C330:L330)=10,\"\",\"Falta información\")),IF(E330=\"Si\",IF(COUNTBLANK(C330:L330)=4,\"Completo\",IF(COUNTBLANK(C330:L330)=10,\"\",\"Falta información\")),\"Falta información\"))","v":"Falta información"},null,null,null,null,null,null,null,null,null,null,null,null,null,null,null,null,null,"VILCUN"]
[323,"Falta información",null,null,null,null,null,null,null,null,null,null,null,null,null,null,null,null,null,"VILLA ALEGRE"]
[324,"Falta información",null,null,null,null,null,null,null,null,null,null,null,null,null,null,null,null,null,"VILLA ALEMANA"]
[325,"Falta información",null,null,null,null,null,null,null,null,null,null,null,null,null,null,null,null,null,"VILLARRICA"]
[326,"Falta información",null,null,null,null,null,null,null,null,null,null,null,null,null,null,null,null,null,"VITACURA"]
[327,"Falta información",null,null,null,null,null,null,null,null,null,null,null,null,null,null,null,null,null,"YERBAS BUENAS"]
[328,"Falta información",null,null,null,null,null,null,null,null,null,null,null,null,null,null,null,null,null,"YUMBEL"]
[329,"Falta información",null,null,null,null,null,null,null,null,null,null,null,null,null,null,null,null,null,"YUNGAY"]
[330,"Falta información",null,null,null,null,null,null,null,null,null,null,null,null,null,null,null,null,null,"ZAPALLAR"]
[331,"Falta información"]
[332,"Falta información"]
[333,"Falta información"]
[334,"Falta información"]
[335,"Falta información"]
[336,"Falta información"]
[337,"Falta información"]
[338,"Falta información"]
[339,"Falta información"]
[340,"Falta información"]
[341,"Falta información"]
[342,"Falta información"]
[343,"Falta información"]
[344,"Falta información"]
[345,"Falta información"]
[346,"Falta información"]
[347,"Falta información"]
[348,"Falta información"]
[349,"Falta información"]
[350,"Falta información"]
[351,"Falta información"]
[352,"Falta información"]
[353,"Falta información"]
[354,"Falta información"]
[355,"Falta información"]
[356,"Falta información"]
[357,"Falta información"]
[358,"Falta información"]
[359,"Falta información"]
[360,"Falta información"]
[361,"Falta información"]
[362,"Falta información"]
[363,"Falta información"]
[364,"Falta información"]
[365,"Falta información"]
[366,"Falta información"]
[367,"Falta información"]
[368,"Falta información"]
[369,"Falta información"]
[370,"Falta información"]
[371,"Falta información"]
[372,"Falta información"]
[373,"Falta información"]
[374,"Falta información"]
[375,"Falta información"]
[376,"Falta información"]
[377,"Falta información"]
[378,"Falta información"]
[379,"Falta información"]
[380,"Falta información"]
[381,"Falta información"]
[382,"Falta información"]
[383,"Falta información"]
[384,"Falta información"]
[385,"Falta información"]
[386,{"$f":"IF(E394=\"No\",IF(COUNTBLANK(C394:L394)=0,\"Completo\",IF(COUNTBLANK(C394:L394)=10,\"\",\"Falta información\")),IF(E394=\"Si\",IF(COUNTBLANK(C394:L394)=4,\"Completo\",IF(COUNTBLANK(C394:L394)=10,\"\",\"Falta información\")),\"Falta información\"))","v":"Falta información"}]
[387,"Falta información"]
[388,"Falta información"]
[389,"Falta información"]
[390,"Falta información"]
[391,"Falta información"]
[392,"Falta información"]
[393,"Falta información"]
[394,"Falta información"]
[395,"Falta información"]
[396,"Falta información"]
[397,"Falta información"]
[398,"Falta información"]
[399,"Falta información"]
[400,"Falta información"]
[401,"Falta información"]
[402,"Falta información"]
[403,"Falta información"]
[404,"Falta información"]
[405,"Falta información"]
[406,"Falta información"]
[407,"Falta información"]
[408,"Falta información"]
[409,"Falta información"]
[410,"Falta información"]
[411,"Falta información"]
[412,"Falta información"]
[413,"Falta información"]
[414,"Falta información"]
[415,"Falta información"]
[416,"Falta información"]
[417,"Falta información"]
[418,"Falta información"]
[419,"Falta información"]
[420,"Falta información"]
[421,"Falta información"]
[422,"Falta información"]
[423,"Falta información"]
[424,"Falta información"]
[425,"Falta información"]
[426,"Falta información"]
[427,"Falta información"]
[428,"Falta información"]
[429,"Falta información"]
[430,"Falta información"]
[431,"Falta información"]
[432,"Falta información"]
[433,"Falta información"]
[434,"Falta información"]
[435,"Falta información"]
[436,"Falta información"]
[437,"Falta información"]
[438,"Falta información"]
[439,"Falta información"]
[440,"Falta información"]
[441,"Falta información"]
[442,"Falta información"]
[443,"Falta información"]
[444,"Falta información"]
[445,"Falta información"]
[446,"Falta información"]
[447,"Falta información"]
[448,"Falta información"]
[449,"Falta información"]
[450,{"$f":"IF(E458=\"No\",IF(COUNTBLANK(C458:L458)=0,\"Completo\",IF(COUNTBLANK(C458:L458)=10,\"\",\"Falta información\")),IF(E458=\"Si\",IF(COUNTBLANK(C458:L458)=4,\"Completo\",IF(COUNTBLANK(C458:L458)=10,\"\",\"Falta información\")),\"Falta información\"))","v":"Falta información"}]
[451,"Falta información"]
[452,"Falta información"]
[453,"Falta información"]
[454,"Falta información"]
[455,"Falta información"]
[456,"Falta información"]
[457,"Falta información"]
[458,"Falta información"]
[459,"Falta información"]
[460,"Falta información"]
[461,"Falta información"]
[462,"Falta información"]
[463,"Falta información"]
[464,"Falta información"]
[465,"Falta información"]
[466,"Falta información"]
[467,"Falta información"]
[468,"Falta información"]
[469,"Falta información"]
[470,"Falta información"]
[471,"Falta información"]
[472,"Falta información"]
[473,"Falta información"]
[474,"Falta información"]
[475,"Falta información"]
[476,"Falta información"]
[477,"Falta información"]
[478,"Falta información"]
[479,"Falta información"]
[480,"Falta información"]
[481,"Falta información"]
[482,"Falta información"]
[483,"Falta información"]
[484,"Falta información"]
[485,"Falta información"]
[486,"Falta información"]
[487,"Falta información"]
[488,"Falta información"]
[489,"Falta información"]
[490,"Falta información"]
[491,"Falta información"]
[492,"Falta información"]
[493,"Falta información"]
[494,"Falta información"]
[495,"Falta información"]
[496,"Falta información"]
[497,"Falta información"]
[498,"Falta información"]
[499,"Falta información"]
[500,"Falta información"]
[501,"Falta información"]
[502,"Falta información"]
[503,"Falta información"]
[504,"Falta información"]
[505,"Falta información"]
[506,"Falta información"]
[507,"Falta información"]
[508,"Falta información"]
[509,"Falta información"]
[510,"Falta información"]
[511,"Falta información"]
[512,"Falta información"]
[513,"Falta información"]
[514,{"$f":"IF(E522=\"No\",IF(COUNTBLANK(C522:L522)=0,\"Completo\",IF(COUNTBLANK(C522:L522)=10,\"\",\"Falta información\")),IF(E522=\"Si\",IF(COUNTBLANK(C522:L522)=4,\"Completo\",IF(COUNTBLANK(C522:L522)=10,\"\",\"Falta información\")),\"Falta información\"))","v":"Falta información"}]
[515,"Falta información"]
[516,"Falta información"]
[517,"Falta información"]
[518,"Falta información"]
[519,"Falta información"]
[520,"Falta información"]
[521,"Falta información"]
[522,"Falta información"]
[523,"Falta información"]
[524,"Falta información"]
[525,"Falta información"]
[526,"Falta información"]
[527,"Falta información"]
[528,"Falta información"]
[529,"Falta información"]
[530,"Falta información"]
[531,"Falta información"]
[532,"Falta información"]
[533,"Falta información"]
[534,"Falta información"]
[535,"Falta información"]
[536,"Falta información"]
[537,"Falta información"]
[538,"Falta información"]
[539,"Falta información"]
[540,"Falta información"]
[541,"Falta información"]
[542,"Falta información"]
[543,"Falta información"]
[544,"Falta información"]
[545,"Falta información"]
[546,"Falta información"]
[547,"Falta información"]
[548,"Falta información"]
[549,"Falta información"]
[550,"Falta información"]
[551,"Falta información"]
[552,"Falta información"]
[553,"Falta información"]
[554,"Falta información"]
[555,"Falta información"]
[556,"Falta información"]
[557,"Falta información"]
[558,"Falta información"]
[559,"Falta información"]
[560,"Falta información"]
[561,"Falta información"]
[562,"Falta información"]
[563,"Falta información"]
[564,"Falta información"]
[565,"Falta información"]
[566,"Falta información"]
[567,"Falta información"]
[568,"Falta información"]
[569,"Falta información"]
[570,"Falta información"]
[571,"Falta información"]
[572,"Falta información"]
[573,"Falta información"]
[574,"Falta información"]
[575,"Falta información"]
[576,"Falta información"]
[577,"Falta información"]
[578,{"$f":"IF(E586=\"No\",IF(COUNTBLANK(C586:L586)=0,\"Completo\",IF(COUNTBLANK(C586:L586)=10,\"\",\"Falta información\")),IF(E586=\"Si\",IF(COUNTBLANK(C586:L586)=4,\"Completo\",IF(COUNTBLANK(C586:L586)=10,\"\",\"Falta información\")),\"Falta información\"))","v":"Falta información"}]
[579,"Falta información"]
[580,"Falta información"]
[581,"Falta información"]
[582,"Falta información"]
[583,"Falta información"]
[584,"Falta información"]
[585,"Falta información"]
[586,"Falta información"]
[587,"Falta información"]
[588,"Falta información"]
[589,"Falta información"]
[590,"Falta información"]
[591,"Falta información"]
[592,"Falta información"]
[593,"Falta información"]
[594,"Falta información"]
[595,"Falta información"]
[596,"Falta información"]
[597,"Falta información"]
[598,"Falta información"]
[599,"Falta información"]
[600,"Falta información"]
[601,"Falta información"]
[602,"Falta información"]
[603,"Falta información"]
[604,"Falta información"]
[605,"Falta información"]
[606,"Falta información"]
[607,"Falta información"]
[608,"Falta información"]
[609,"Falta información"]
[610,"Falta información"]
[611,"Falta información"]
[612,"Falta información"]
[613,"Falta información"]
[614,"Falta información"]
[615,"Falta información"]
[616,"Falta información"]
[617,"Falta información"]
[618,"Falta información"]
[619,"Falta información"]
[620,"Falta información"]
[621,"Falta información"]
[622,"Falta información"]
[623,"Falta información"]
[624,"Falta información"]
[625,"Falta información"]
[626,"Falta información"]
[627,"Falta información"]
[628,"Falta información"]
[629,"Falta información"]
[630,"Falta información"]
[631,"Falta información"]
[632,"Falta información"]
[633,"Falta información"]
[634,"Falta información"]
[635,"Falta información"]
[636,"Falta información"]
[637,"Falta información"]
[638,"Falta información"]
[639,"Falta información"]
[640,"Falta información"]
[641,"Falta información"]
[642,{"$f":"IF(E650=\"No\",IF(COUNTBLANK(C650:L650)=0,\"Completo\",IF(COUNTBLANK(C650:L650)=10,\"\",\"Falta información\")),IF(E650=\"Si\",IF(COUNTBLANK(C650:L650)=4,\"Completo\",IF(COUNTBLANK(C650:L650)=10,\"\",\"Falta información\")),\"Falta información\"))","v":"Falta información"}]
[643,"Falta información"]
[644,"Falta información"]
[645,"Falta información"]
[646,"Falta información"]
[647,"Falta información"]
[648,"Falta información"]
[649,"Falta información"]
[650,"Falta información"]
[651,"Falta información"]
[652,"Falta información"]
[653,"Falta información"]
[654,"Falta información"]
[655,"Falta información"]
[656,"Falta información"]
[657,"Falta información"]
[658,"Falta información"]
[659,"Falta información"]
[660,"Falta información"]
[661,"Falta información"]
[662,"Falta información"]
[663,"Falta información"]
[664,"Falta información"]
[665,"Falta información"]
[666,"Falta información"]
[667,"Falta información"]
[668,"Falta información"]
[669,"Falta información"]
[670,"Falta información"]
[671,"Falta información"]
[672,"Falta información"]
[673,"Falta información"]
[674,"Falta información"]
[675,"Falta información"]
[676,"Falta información"]
[677,"Falta información"]
[678,"Falta información"]
[679,"Falta información"]
[680,"Falta información"]
[681,"Falta información"]
[682,"Falta información"]
[683,"Falta información"]
[684,"Falta información"]
[685,"Falta información"]
[686,"Falta información"]
[687,"Falta información"]
[688,"Falta información"]
[689,"Falta información"]
[690,"Falta información"]
[691,"Falta información"]
[692,"Falta información"]
[693,"Falta información"]
[694,"Falta información"]
[695,"Falta información"]
[696,"Falta información"]
[697,"Falta información"]
[698,"Falta información"]
[699,"Falta información"]
[700,"Falta información"]
[701,"Falta información"]
[702,"Falta información"]
[703,"Falta información"]
[704,"Falta información"]
[705,"Falta información"]
[706,{"$f":"IF(E714=\"No\",IF(COUNTBLANK(C714:L714)=0,\"Completo\",IF(COUNTBLANK(C714:L714)=10,\"\",\"Falta información\")),IF(E714=\"Si\",IF(COUNTBLANK(C714:L714)=4,\"Completo\",IF(COUNTBLANK(C714:L714)=10,\"\",\"Falta información\")),\"Falta información\"))","v":"Falta información"}]
[707,"Falta información"]
[708,"Falta información"]
[709,"Falta información"]
[710,"Falta información"]
[711,"Falta información"]
[712,"Falta información"]
[713,"Falta información"]
[714,"Falta información"]
[715,"Falta información"]
[716,"Falta información"]
[717,"Falta información"]
[718,"Falta información"]
[719,"Falta información"]
[720,"Falta información"]
[721,"Falta información"]
[722,"Falta información"]
[723,"Falta información"]
[724,"Falta información"]
[725,"Falta información"]
[726,"Falta información"]
[727,"Falta información"]
[728,"Falta información"]
[729,"Falta información"]
[730,"Falta información"]
[731,"Falta información"]
[732,"Falta información"]
[733,"Falta información"]
[734,"Falta información"]
[735,"Falta información"]
[736,"Falta información"]
[737,"Falta información"]
[738,"Falta información"]
[739,"Falta información"]
[740,"Falta información"]
[741,"Falta información"]
[742,"Falta información"]
[743,"Falta información"]
[744,"Falta información"]
[745,"Falta información"]
[746,"Falta información"]
[747,"Falta información"]
[748,"Falta información"]
[749,"Falta información"]
[750,"Falta información"]
[751,"Falta información"]
[752,"Falta información"]
[753,"Falta información"]
[754,"Falta información"]
[755,"Falta información"]
[756,"Falta información"]
[757,"Falta información"]
[758,"Falta información"]
[759,"Falta información"]
[760,"Falta información"]
[761,"Falta información"]
[762,"Falta información"]
[763,"Falta información"]
[764,"Falta información"]
[765,"Falta información"]
[766,"Falta información"]
[767,"Falta información"]
[768,"Falta información"]
[769,"Falta información"]
[770,{"$f":"IF(E778=\"No\",IF(COUNTBLANK(C778:L778)=0,\"Completo\",IF(COUNTBLANK(C778:L778)=10,\"\",\"Falta información\")),IF(E778=\"Si\",IF(COUNTBLANK(C778:L778)=4,\"Completo\",IF(COUNTBLANK(C778:L778)=10,\"\",\"Falta información\")),\"Falta información\"))","v":"Falta información"}]
[771,"Falta información"]
[772,"Falta información"]
[773,"Falta información"]
[774,"Falta información"]
[775,"Falta información"]
[776,"Falta información"]
[777,"Falta información"]
[778,"Falta información"]
[779,"Falta información"]
[780,"Falta información"]
[781,"Falta información"]
[782,"Falta información"]
[783,"Falta información"]
[784,"Falta información"]
[785,"Falta información"]
[786,"Falta información"]
[787,"Falta información"]
[788,"Falta información"]
[789,"Falta información"]
[790,"Falta información"]
[791,"Falta información"]
[792,"Falta información"]
[793,"Falta información"]
[794,"Falta información"]
[795,"Falta información"]
[796,"Falta información"]
[797,"Falta información"]
[798,"Falta información"]
[799,"Falta información"]
[800,"Falta información"]
[801,"Falta información"]
[802,"Falta información"]
[803,"Falta información"]
[804,"Falta información"]
[805,"Falta información"]
[806,"Falta información"]
[807,"Falta información"]
[808,"Falta información"]
[809,"Falta información"]
[810,"Falta información"]
[811,"Falta información"]
[812,"Falta información"]
[813,"Falta información"]
[814,"Falta información"]
[815,"Falta información"]
[816,"Falta información"]
[817,"Falta información"]
[818,"Falta información"]
[819,"Falta información"]
[820,"Falta información"]
[821,"Falta información"]
[822,"Falta información"]
[823,"Falta información"]
[824,"Falta información"]
[825,"Falta información"]
[826,"Falta información"]
[827,"Falta información"]
[828,"Falta información"]
[829,"Falta información"]
[830,"Falta información"]
[831,"Falta información"]
[832,"Falta información"]
[833,"Falta información"]
[834,{"$f":"IF(E842=\"No\",IF(COUNTBLANK(C842:L842)=0,\"Completo\",IF(COUNTBLANK(C842:L842)=10,\"\",\"Falta información\")),IF(E842=\"Si\",IF(COUNTBLANK(C842:L842)=4,\"Completo\",IF(COUNTBLANK(C842:L842)=10,\"\",\"Falta información\")),\"Falta información\"))","v":"Falta información"}]
[835,"Falta información"]
[836,"Falta información"]
[837,"Falta información"]
[838,"Falta información"]
[839,"Falta información"]
[840,"Falta información"]
[841,"Falta información"]
[842,"Falta información"]
[843,"Falta información"]
[844,"Falta información"]
[845,"Falta información"]
[846,"Falta información"]
[847,"Falta información"]
[848,"Falta información"]
[849,"Falta información"]
[850,"Falta información"]
[851,"Falta información"]
[852,"Falta información"]
[853,"Falta información"]
[854,"Falta información"]
[855,"Falta información"]
[856,"Falta información"]
[857,"Falta información"]
[858,"Falta información"]
[859,"Falta información"]
[860,"Falta información"]
[861,"Falta información"]
[862,"Falta información"]
[863,"Falta información"]
[864,"Falta información"]
[865,"Falta información"]
[866,"Falta información"]
[867,"Falta información"]
[868,"Falta información"]
[869,"Falta información"]
[870,"Falta información"]
[871,"Falta información"]
[872,"Falta información"]
[873,"Falta información"]
[874,"Falta información"]
[875,"Falta información"]
[876,"Falta información"]
[877,"Falta información"]
[878,"Falta información"]
[879,"Falta información"]
[880,"Falta información"]
[881,"Falta información"]
[882,"Falta información"]
[883,"Falta información"]
[884,"Falta información"]
[885,"Falta información"]
[886,"Falta información"]
[887,"Falta información"]
[888,"Falta información"]
[889,"Falta información"]
[890,"Falta información"]
[891,"Falta información"]
[892,"Falta información"]
[893,"Falta información"]
[894,"Falta información"]
[895,"Falta información"]
[896,"Falta información"]
[897,"Falta información"]
[898,{"$f":"IF(E906=\"No\",IF(COUNTBLANK(C906:L906)=0,\"Completo\",IF(COUNTBLANK(C906:L906)=10,\"\",\"Falta información\")),IF(E906=\"Si\",IF(COUNTBLANK(C906:L906)=4,\"Completo\",IF(COUNTBLANK(C906:L906)=10,\"\",\"Falta información\")),\"Falta información\"))","v":"Falta información"}]
[899,"Falta información"]
[900,"Falta información"]
[901,"Falta información"]
[902,"Falta información"]
[903,"Falta información"]
[904,"Falta información"]
[905,"Falta información"]
[906,"Falta información"]
[907,"Falta información"]
[908,"Falta información"]
[909,"Falta información"]
[910,"Falta información"]
[911,"Falta información"]
[912,"Falta información"]
[913,"Falta información"]
[914,"Falta información"]
[915,"Falta información"]
[916,"Falta información"]
[917,"Falta información"]
[918,"Falta información"]
[919,"Falta información"]
[920,"Falta información"]
[921,"Falta información"]
[922,"Falta información"]
[923,"Falta información"]
[924,"Falta información"]
[925,"Falta información"]
[926,"Falta información"]
[927,"Falta información"]
[928,"Falta información"]
[929,"Falta información"]
[930,"Falta información"]
[931,"Falta información"]
[932,"Falta información"]
[933,"Falta información"]
[934,"Falta información"]
[935,"Falta información"]
[936,"Falta información"]
[937,"Falta información"]
[938,"Falta información"]
[939,"Falta información"]
[940,"Falta información"]
[941,"Falta información"]
[942,"Falta información"]
[943,"Falta información"]
[944,"Falta información"]
[945,"Falta información"]
[946,"Falta información"]
[947,"Falta información"]
[948,"Falta información"]
[949,"Falta información"]
[950,"Falta información"]
[951,"Falta información"]
[952,"Falta información"]
[953,"Falta información"]
[954,"Falta información"]
[955,"Falta información"]
[956,"Falta información"]
[957,"Falta información"]
[958,"Falta información"]
[959,"Falta información"]
[960,"Falta información"]
[961,"Falta información"]
[962,{"$f":"IF(E970=\"No\",IF(COUNTBLANK(C970:L970)=0,\"Completo\",IF(COUNTBLANK(C970:L970)=10,\"\",\"Falta información\")),IF(E970=\"Si\",IF(COUNTBLANK(C970:L970)=4,\"Completo\",IF(COUNTBLANK(C970:L970)=10,\"\",\"Falta información\")),\"Falta información\"))","v":"Falta información"}]
[963,"Falta información"]
[964,"Falta información"]
[965,"Falta información"]
[966,"Falta información"]
[967,"Falta información"]
[968,"Falta información"]
[969,"Falta información"]
[970,"Falta información"]
[971,"Falta información"]
[972,"Falta información"]
[973,"Falta información"]
[974,"Falta información"]
[975,"Falta información"]
[976,"Falta información"]
[977,"Falta información"]
[978,"Falta información"]
[979,"Falta información"]
[980,"Falta información"]
[981,"Falta información"]
[982,"Falta información"]
[983,"Falta información"]
[984,"Falta información"]
[985,"Falta información"]
[986,"Falta información"]
[987,"Falta información"]
[988,"Falta información"]
[989,"Falta información"]
[990,"Falta información"]
[991,"Falta información"]
[992,"Falta información"]
[993,"Falta información"]
[994,"Falta información"]
[995,"Falta información"]
[996,"Falta información"]
[997,"Falta información"]
[998,"Falta información"]
[999,"Falta información"]
[1000,"Falta información"]

{"sheet":"Hoja4","index":1,"n_rows":2763,"n_cols":6,"rows_kept":2763,"cut":false,"hidden":true,"merged":[]}
["RBD","COD_COM_RBD","NOM_RBD","NOM_COM_RBD","RBD","COD_COM_RBD"]
[8384,11201,"ESCUELA ALMIRANTE SIMPSON","AISEN",8384,11201]
[8377,11201,"ESCUELA AYSEN","AISEN",8377,11201]
[8376,11201,"ESCUELA BASICA","AISEN",8376,11201]
[11612,11201,"ESCUELA BASICA RIBERA SUR","AISEN",11612,11201]
[8382,11201,"ESCUELA CARLOS CONDELL","AISEN",8382,11201]
[24229,11201,"ESCUELA LITORAL AUSTRAL","AISEN",24229,11201]
[8379,11201,"ESCUELA PEDRO AGUIRRE CERDA","AISEN",8379,11201]
[8380,11201,"LICEO MANIHUALES","AISEN",8380,11201]
[2084,5602,"COLEGIO CARLOS ALESSANDRI ALTAMIRANO","ALGARROBO",2084,5602]
[2085,5602,"ESCUELA BASICA RURAL EL YECO","ALGARROBO",2085,5602]
[14457,5602,"ESCUELA DE PARVULOS LOS CLAVELES","ALGARROBO",14457,5602]
[10878,13502,"ESCUELA BARRANCAS DE PICHI","ALHUE",10878,13502]
[10877,13502,"ESCUELA EL ASIENTO","ALHUE",10877,13502]
[10880,13502,"ESCUELA HACIENDA ALHUE","ALHUE",10880,13502]
[10879,13502,"ESCUELA SAN ALFONSO","ALHUE",10879,13502]
[10873,13502,"LICEO MUNICIPAL SARA TRONCOSO TRONCOSO","ALHUE",10873,13502]
[4374,8314,"ESCUELA BASICA PITRIL","ALTO BIOBIO",4374,8314]
[4379,8314,"ESCUELA CALLAQUI","ALTO BIOBIO",4379,8314]
[4354,8314,"ESCUELA DE CONCENTRACIÓN FRONTERIZA RALCO ALTO BIOBÍO","ALTO BIOBIO",4354,8314]
[4375,8314,"ESCUELA RALCO LEPOY","ALTO BIOBIO",4375,8314]
[493,3302,"EDUCADOR ARTURO ALVEAR RAMOS","ALTO DEL CARMEN",493,3302]
[11025,3302,"ESCUELA FRONTERIZA","ALTO DEL CARMEN",11025,3302]
[499,3302,"ESCUELA RICARDO CAMPILLAY CONTRERAS","ALTO DEL CARMEN",499,3302]
[12632,1107,"COLEGIO SIMON BOLIVAR","ALTO HOSPICIO",12632,1107]
[12739,1107,"ESC ESP DE LENGUAJE OASIS DEL SABER","ALTO HOSPICIO",12739,1107]
[8047,10202,"ESCUELA ANEXA","ANCUD",8047,10202]
[8050,10202,"ESCUELA FATIMA","ANCUD",8050,10202]
[8046,10202,"ESCUELA PUDETO","ANCUD",8046,10202]
[8103,10202,"ESCUELA RURAL BAHIA LINAO","ANCUD",8103,10202]
[8051,10202,"ESCUELA RURAL EL PALOMAR","ANCUD",8051,10202]
[8092,10202,"ESCUELA RURAL LUIS ALBERTO SEGOVIA ROSS","ANCUD",8092,10202]
[8054,10202,"ESCUELA RURAL MANAO","ANCUD",8054,10202]
[8085,10202,"ESCUELA RURAL SAN MIGUEL DE COÑIMO","ANCUD",8085,10202]
[8053,10202,"ESCUELA RURAL SENDA CHACAO","ANCUD",8053,10202]
[8100,10202,"ESCUELA RURAL SOL DEL PACIFICO","ANCUD",8100,10202]
[8049,10202,"ESCUELA RURAL VILLA CHACAO","ANCUD",8049,10202]
[8048,10202,"ESCUELA YERBAS BUENAS","ANCUD",8048,10202]
[13563,4103,"COLEGIO NUESTRA SEÑORA DEL ROSARIO","ANDACOLLO",13563,4103]
[657,4103,"ESCUELA LUIS CRUZ MARTINEZ","ANDACOLLO",657,4103]
[658,4103,"ESCUELA PATRICIO LYNCH","ANDACOLLO",658,4103]
[5225,9201,"COLEGIO MARÍA SYLVESTER RASCH","ANGOL",5225,9201]
[5249,9201,"ESC. BASICA MANUEL RODRIGUEZ","ANGOL",5249,9201]
[5229,9201,"ESCUELA BASICA ARAGON","ANGOL",5229,9201]
[5221,9201,"ESCUELA BASICA NAHUELBUTA","ANGOL",5221,9201]
[5226,9201,"ESCUELA DIEGO DUBLE URRUTIA","ANGOL",5226,9201]
[5220,9201,"ESCUELA HERMANOS CARRERA","ANGOL",5220,9201]
[5227,9201,"ESCUELA JOSÉ ELÍAS BOLIVAR HERRERA","ANGOL",5227,9201]
[5224,9201,"ESCUELA REPUBLICA FEDERAL ALEMANA","ANGOL",5224,9201]
[5228,9201,"ESCUELA VILLA HUEQUEN","ANGOL",5228,9201]
[297,2101,"ESCUELA ALCALDE MAXIMILIANO POBLETE","ANTOFAGASTA",297,2101]
[320,2101,"ESCUELA ARMANDO CARRERA GONZALEZ","ANTOFAGASTA",320,2101]
[313,2101,"ESCUELA ARTURO PRAT","ANTOFAGASTA",313,2101]
[310,2101,"ESCUELA CLAUDIO MATTE PEREZ","ANTOFAGASTA",310,2101]
[298,2101,"ESCUELA DARIO SALAS DIAZ","ANTOFAGASTA",298,2101]
[333,2101,"ESCUELA DE PARVULOS BLANCA NIEVES","ANTOFAGASTA",333,2101]
[330,2101,"ESCUELA DE PARVULOS LOS PINGUINITOS","ANTOFAGASTA",330,2101]
[307,2101,"ESCUELA DE PARVULOS MARCELA PAZ","ANTOFAGASTA",307,2101]
[12822,2101,"ESCUELA DE PARVULOS SEMILLITA","ANTOFAGASTA",12822,2101]
[312,2101,"ESCUELA ECUADOR","ANTOFAGASTA",312,2101]
[318,2101,"ESCUELA EDDA CUNEO DONNAGIO","ANTOFAGASTA",318,2101]
[12962,2101,"ESCUELA ELMO FUNEZ CARRIZO","ANTOFAGASTA",12962,2101]
[289,2101,"ESCUELA ESPANA","ANTOFAGASTA",289,2101]
[324,2101,"ESCUELA FUNDACION MINERA ESCONDIDA","ANTOFAGASTA",324,2101]
[332,2101,"ESCUELA GABRIELA MISTRAL","ANTOFAGASTA",332,2101]
[322,2101,"ESCUELA GENERAL MANUEL BAQUEDANO","ANTOFAGASTA",322,2101]
[305,2101,"ESCUELA GONZALEZ ECHEGOYEN","ANTOFAGASTA",305,2101]
[315,2101,"ESCUELA HEROES DE LA CONCEPCION","ANTOFAGASTA",315,2101]
[306,2101,"ESCUELA HUANCHACA","ANTOFAGASTA",306,2101]
[293,2101,"ESCUELA JOSE PAPIC RADNIC","ANTOFAGASTA",293,2101]
[302,2101,"ESCUELA JUAN LOPEZ","ANTOFAGASTA",302,2101]
[12840,2101,"ESCUELA JUAN PABLO II","ANTOFAGASTA",12840,2101]
[319,2101,"ESCUELA LA BANDERA","ANTOFAGASTA",319,2101]
[316,2101,"ESCUELA LAS AMERICAS PROFESOR JUSTO VALLADARES ORELLANA","ANTOFAGASTA",316,2101]
[291,2101,"ESCUELA PADRE GUSTAVO LE PAIGE WALQUE","ANTOFAGASTA",291,2101]
[303,2101,"ESCUELA REPUBLICA ARGENTINA","ANTOFAGASTA",303,2101]
[292,2101,"ESCUELA REPUBLICA DE ITALIA","ANTOFAGASTA",292,2101]
[296,2101,"ESCUELA REPUBLICA DE LOS ESTADOS UNIDOS","ANTOFAGASTA",296,2101]
[301,2101,"ESCUELA ROMULO J. PENA MATURANA","ANTOFAGASTA",301,2101]
[326,2101,"ESCUELA SANTIAGO AMENGUAL B.","ANTOFAGASTA",326,2101]
[329,2101,"INSTITUTO CIENTÍFICO EDUCACIONAL JOSÉ MAZA SANCHO","ANTOFAGASTA",329,2101]
[304,2101,"LICEO ANDRES SABELLA","ANTOFAGASTA",304,2101]
[284,2101,"LICEO DE HOMBRES DE ANTOFAGASTA MARIO BAHAMONDE SILVA","ANTOFAGASTA",284,2101]
[285,2101,"LICEO MARTA NAREA DIAZ","ANTOFAGASTA",285,2101]
[12944,2101,"REVERENDO PADRE PATRICIO CARIOLA","ANTOFAGASTA",12944,2101]
[4330,8302,"ESCUELA OLGA RIOS DE PINOCHET","ANTUCO",4330,8302]
[4327,8302,"ESCUELA VOLCAN ANTUCO","ANTUCO",4327,8302]
[4324,8302,"LICEO DOCTOR VÍCTOR RÍOS RUIZ","ANTUCO",4324,8302]
[5051,8202,"ESCUELA BÁSICA DE CARAMPANGUE","ARAUCO",5051,8202]
[5050,8202,"ESCUELA BÁSICA MARE NOSTRUM","ARAUCO",5050,8202]
[5073,8202,"ESCUELA BASICA BRISAS DEL MAR","ARAUCO",5073,8202]
[5074,8202,"ESCUELA BASICA CESAR MONSALVE FLORES","ARAUCO",5074,8202]
[5054,8202,"ESCUELA BASICA SAN PEDRO DE LARAQUETE","ARAUCO",5054,8202]
[5049,8202,"ESCUELA BASICA VICENTE MILLAN IRIARTE","ARAUCO",5049,8202]
[17874,8202,"ESCUELA EDELMIRA VERGARA QUIÑONES","ARAUCO",17874,8202]
[18155,8202,"ESCUELA ESPECIAL DE LENGUAJE ARAUCO","ARAUCO",18155,8202]
[5053,8202,"ESCUELA JORGE IVAN VALENZUELA ZUNIGA","ARAUCO",5053,8202]
[5052,8202,"ESCUELA LOS PINOS","ARAUCO",5052,8202]
[5072,8202,"ESCUELA VALLE ARAUCO","ARAUCO",5072,8202]
[5055,8202,"ESCUELA VALLE RAMADILLAS","ARAUCO",5055,8202]
[5057,8202,"LICEO TÉCNICO PESQUERO FILIDOR GAETE MONSÁLVEZ","ARAUCO",5057,8202]
[25,15101,"COLEGIO CENTENARIO DE ARICA","ARICA",25,15101]
[8,15101,"COLEGIO INTEGRADO EDUARDO FREI MONTALVA","ARICA",8,15101]
[18,15101,"ESC. COMTE. JUAN JOSE SAN MARTIN","ARICA",18,15101]
[11,15101,"ESC. GRAL. PEDRO LAGOS MARCHANT","ARICA",11,15101]
[19,15101,"ESC. HUMBERTO VALENZUELA GARCIA","ARICA",19,15101]
[29,15101,"ESCUELA AMERICA","ARICA",29,15101]
[33,15101,"ESCUELA CARLOS CONDELL DE LA HAZA","ARICA",33,15101]
[31,15101,"ESCUELA DARIO SALAS DIAZ","ARICA",31,15101]
[30,15101,"ESCUELA DR. RICARDO OLEA GUERRA","ARICA",30,15101]
[27,15101,"ESCUELA ESMERALDA","ARICA",27,15101]
[38,15101,"ESCUELA ESPAÑA","ARICA",38,15101]
[22,15101,"ESCUELA GABRIELA MISTRAL","ARICA",22,15101]
[12,15101,"ESCUELA GRAL JOSE MIGUEL CARRERA","ARICA",12,15101]
[35,15101,"ESCUELA GRAL. MANUEL BAQUEDANO","ARICA",35,15101]
[36,15101,"ESCUELA IGNACIO CARRERA PINTO","ARICA",36,15101]
[12501,15101,"ESCUELA JORGE ALESSANDRI RODRIGUEZ","ARICA",12501,15101]
[13,15101,"ESCUELA MANUEL RODRIGUEZ ERDOYZA","ARICA",13,15101]
[39,15101,"ESCUELA PAMPA ALGODONAL","ARICA",39,15101]
[16,15101,"ESCUELA REGIMIENTO RANCAGUA","ARICA",16,15101]
[26,15101,"ESCUELA REPUBLICA DE ARGENTINA","ARICA",26,15101]
[10,15101,"ESCUELA REPUBLICA DE FRANCIA","ARICA",10,15101]
[9,15101,"ESCUELA REPUBLICA DE ISRAEL","ARICA",9,15101]
[28,15101,"ESCUELA RICARDO SILVA ARRIAGADA","ARICA",28,15101]
[14,15101,"ESCUELA ROMULO J. PENA MATURANA","ARICA",14,15101]
[17,15101,"ESCUELA SUBTTE. LUIS CRUZ MARTINEZ","ARICA",17,15101]
[20,15101,"ESCUELA TUCAPEL","ARICA",20,15101]
[32,15101,"LICEO AGRICOLA JOSE ABELARDO NUNEZ M.","ARICA",32,15101]
[2,15101,"PARVULARIO LAS ESPIGUITAS","ARICA",2,15101]
[10640,13402,"COLEGIO DE MAIPO","BUIN",10640,13402]
[10656,13402,"ESCUELA BASICA G-N°813 LOS AROMOS DE EL RECURSO","BUIN",10656,13402]
[10649,13402,"ESCUELA HUMBERTO MORENO RAMIREZ","BUIN",10649,13402]
[10648,13402,"ESCUELA LO SALINAS","BUIN",10648,13402]
[10651,13402,"ESCUELA LOS ROSALES DEL BAJO","BUIN",10651,13402]
[10646,13402,"ESCUELA VALDIVIA DE PAINE","BUIN",10646,13402]
[10643,13402,"ESCUELA VILLASECA","BUIN",10643,13402]
[10652,13402,"ESCUELA VILUCO","BUIN",10652,13402]
[10638,13402,"LICEO 131","BUIN",10638,13402]
[10641,13402,"LICEO ALTO JAHUEL","BUIN",10641,13402]
[10645,13402,"LICEO FRANCISCO JAVIER KRUGGER ALVARADO","BUIN",10645,13402]
[17742,8402,"ESCUELA BASICA EDUARDO FREI MONTALBA","BULNES",17742,8402]
[3980,8402,"ESCUELA BASICA PUEBLO SECO SANTA CLARA","BULNES",3980,8402]
[3982,8402,"ESCUELA BATALLA DEL ROBLE","BULNES",3982,8402]
[3984,8402,"ESCUELA CANTA RANA","BULNES",3984,8402]
[3978,8402,"ESCUELA CELIA URRUTIA PRIETO","BULNES",3978,8402]
[3991,8402,"ESCUELA COLTON QUILLAY","BULNES",3991,8402]
[3997,8402,"ESCUELA EL CARACOL","BULNES",3997,8402]
[3981,8402,"ESCUELA EL PALPAL DE SANTA CLARA","BULNES",3981,8402]
[3983,8402,"ESCUELA EVARISTA OGALDE ORTEGA","BULNES",3983,8402]
[3995,8402,"ESCUELA LOS TILOS","BULNES",3995,8402]
[3992,8402,"ESCUELA MILAHUE","BULNES",3992,8402]
[3977,8402,"LICEO SANTA CRUZ DE LARQUI","BULNES",3977,8402]
[1180,5402,"ESCUELA BASICA G-45","CABILDO",1180,5402]
[1178,5402,"ESCUELA BASICA LA VINA","CABILDO",1178,5402]
[14479,5402,"ESCUELA BASICA MUNICIPAL ARAUCARIA","CABILDO",14479,5402]
[1174,5402,"ESCUELA BASICA SAN LORENZO","CABILDO",1174,5402]
[1170,5402,"ESCUELA BASICA VALLE DE ARTIFICIO","CABILDO",1170,5402]
[1173,5402,"ESCUELA ESTER SILVA SOMARRIVA BARTOLILLO","CABILDO",1173,5402]
[1168,5402,"ESCUELA HANS WENKE MENGERS","CABILDO",1168,5402]
[1176,5402,"ESCUELA PABLO NERUDA","CABILDO",1176,5402]
[8483,12201,"LICEO DONALD MC-INTYRE GRIFFITHS","CABO DE HORNOS",8483,12201]
[17814,8303,"ESCUELA ALTO CABRERO","CABRERO",17814,8303]
[12020,8303,"ESCUELA BASICA ENRIQUE ZANARTU PRIETO","CABRERO",12020,8303]
[4290,8303,"ESCUELA CHARRUA","CABRERO",4290,8303]
[4302,8303,"ESCUELA COLICHEU","CABRERO",4302,8303]
[4298,8303,"ESCUELA EL MANZANO","CABRERO",4298,8303]
[4299,8303,"ESCUELA EL PARAISO","CABRERO",4299,8303]
[4306,8303,"ESCUELA EL PROGRESO","CABRERO",4306,8303]
[4297,8303,"ESCUELA LAS OBRAS","CABRERO",4297,8303]
[17787,8303,"ESCUELA ORLANDO VERA VILLARROEL","CABRERO",17787,8303]
[4295,8303,"ESCUELA PILLANCO","CABRERO",4295,8303]
[4022,8303,"ESCUELA QUINEL","CABRERO",4022,8303]
[4292,8303,"ESCUELA SALTO EL LAJA","CABRERO",4292,8303]
[5128,8203,"ESCUELA ARTURO PRAT CHACON","CAÑETE",5128,8203]
[5131,8203,"ESCUELA BÁSICA HOMERO VIGUERAS ARANEDA","CAÑETE",5131,8203]
[5123,8203,"ESCUELA BASICA CACIQUE FRANCISCO MELIN","CAÑETE",5123,8203]
[5140,8203,"ESCUELA BASICA FEDERICO GANA","CAÑETE",5140,8203]
[5158,8203,"ESCUELA BASICA JUAN AGUILERA JEREZ","CAÑETE",5158,8203]
[5172,8203,"ESCUELA BASICA JUAN LAVIN ALVEAR","CAÑETE",5172,8203]
[5134,8203,"ESCUELA BASICA LA GRANJA","CAÑETE",5134,8203]
[5133,8203,"ESCUELA BASICA LLONCAO","CAÑETE",5133,8203]
[5129,8203,"ESCUELA BASICA RENE ANDRADES TOLEDO","CAÑETE",5129,8203]
[5130,8203,"ESCUELA BASICA RUBI NELSON SILVA SALAS","CAÑETE",5130,8203]
[5147,8203,"ESCUELA BASICA TRES SAUCES","CAÑETE",5147,8203]
[18089,8203,"ESCUELA DE LENGUAJE BAMBI","CAÑETE",18089,8203]
[5127,8203,"ESCUELA LEONCIO ARANEDA FIGUEROA","CAÑETE",5127,8203]
[5132,8203,"ESCUELA RICARDO COLOMA DIAZ","CAÑETE",5132,8203]
[246,2201,"ESCUELA BASICA SENORA DE LA CANDELARIA","CALAMA",246,2201]
[12882,2201,"ESCUELA DE PARVULOS INTI PANNI","CALAMA",12882,2201]
[236,2201,"ESCUELA DE PARVULOS LAS ABEJITAS","CALAMA",236,2201]
[237,2201,"ESCUELA DE PARVULOS LLAMITO BLANCO","CALAMA",237,2201]
[265,2201,"ESCUELA DE PARVULOS LOS CONEJITOS","CALAMA",265,2201]
[244,2201,"ESCUELA DE PARVULOS LOS ENANITOS","CALAMA",244,2201]
[245,2201,"ESCUELA DE PARVULOS PAPELUCHO","CALAMA",245,2201]
[12811,2201,"ESCUELA DE PARVULOS QUILLA ANTAY","CALAMA",12811,2201]
[238,2201,"ESCUELA DIFERENCIAL LOA","CALAMA",238,2201]
[241,2201,"ESCUELA PARVULARIA LAS ARDILLAS","CALAMA",241,2201]
[7773,10102,"ESCUELA EULOGIO GOYCOLEA GARAY","CALBUCO",7773,10102]
[22539,10102,"ESCUELA JOSE MANUEL BALMACEDA","CALBUCO",22539,10102]
[7825,10102,"ESCUELA LIBERTADOR GENERAL BERNARDO O┤HIGGINS RIQUELME","CALBUCO",7825,10102]
[7791,10102,"ESCUELA RURAL AGUANTAO","CALBUCO",7791,10102]
[7783,10102,"ESCUELA RURAL CHAUQUEAR","CALBUCO",7783,10102]
[7788,10102,"ESCUELA RURAL CHAYAHUE","CALBUCO",7788,10102]
[7777,10102,"ESCUELA RURAL EL ROSARIO","CALBUCO",7777,10102]
[7775,10102,"ESCUELA RURAL PARGUA","CALBUCO",7775,10102]
[7818,10102,"ESCUELA RURAL PEÑASMO","CALBUCO",7818,10102]
[7801,10102,"ESCUELA RURAL PUTENIO","CALBUCO",7801,10102]
[7785,10102,"ESCUELA RURAL QUETROLAUQUEN","CALBUCO",7785,10102]
[7802,10102,"ESCUELA RURAL SAN JOSE","CALBUCO",7802,10102]
[7774,10102,"ESCUELA RURAL SAN RAFAEL","CALBUCO",7774,10102]
[13143,3102,"BYRON GIGOUX JAMES","CALDERA",13143,3102]
[13104,3102,"ESCUELA MANUEL ORELLA ECHANEZ","CALDERA",13104,3102]
[13177,3102,"ESCUELA VILLA LAS PLAYAS","CALDERA",13177,3102]
[1425,5502,"COMPLEJO EDUCACIONAL LAS ACACIAS DE ARTIFICIO","CALERA",1425,5502]
[1433,5502,"ESCUELA BASICA EL LIBERTADOR","CALERA",1433,5502]
[1430,5502,"ESCUELA BASICA GABRIELA MISTRAL","CALERA",1430,5502]
[1424,5502,"ESCUELA BASICA IRMA SAPIAIN","CALERA",1424,5502]
[1423,5502,"ESCUELA BASICA JOSEFINA HUICI","CALERA",1423,5502]
[1427,5502,"ESCUELA BASICA PALESTINA","CALERA",1427,5502]
[1431,5502,"ESCUELA BASICA SANTA ROSA DEL HUERTO","CALERA",1431,5502]
[1435,5502,"ESCUELA BASICA VILLA LA FLORIDA","CALERA",1435,5502]
[1428,5502,"ESCUELA ESPECIAL JESUS DE NAZARETH","CALERA",1428,5502]
[1461,5502,"ESCUELA MONTE CARMELO","CALERA",1461,5502]
[10687,13403,"ESCUELA BASICA F-N°798 CALERA DE TANGO","CALERA DE TANGO",10687,13403]
[10688,13403,"LICEO LONQUEN","CALERA DE TANGO",10688,13403]
[10686,13403,"LICEO MUNICIPAL POETISA GABRIELA MISTRAL","CALERA DE TANGO",10686,13403]
[1251,5302,"ESCUELA BASICA CRISTO REDENTOR","CALLE LARGA",1251,5302]
[1248,5302,"ESCUELA BASICA LA PAMPILLA","CALLE LARGA",1248,5302]
[1247,5302,"ESCUELA BASICA MARIA ISABEL DE BROWN","CALLE LARGA",1247,5302]
[1252,5302,"ESCUELA BASICA VALLE ALEGRE","CALLE LARGA",1252,5302]
[1250,5302,"ESCUELA VICTOR KOERNER","CALLE LARGA",1250,5302]
[1100,4202,"ESC.BASICA CARLOS VIAL ESPANTOSO","CANELA",1100,4202]
[1087,4202,"ESCUELA BASICA CANELA ALTA","CANELA",1087,4202]
[1078,4202,"ESCUELA BASICA JUAN ANTONIO RIOS","CANELA",1078,4202]
[6501,9102,"ESCUELA BASICA KIM RUKA","CARAHUE",6501,9102]
[6502,9102,"ESCUELA BASICA NEHUENTUE","CARAHUE",6502,9102]
[6500,9102,"ESCUELA DARIO SALAS DIAZ","CARAHUE",6500,9102]
[12366,9102,"ESCUELA ESPECIAL ARCO IRIS","CARAHUE",12366,9102]
[6504,9102,"ESCUELA TRANAPUENTE","CARAHUE",6504,9102]
[6499,9102,"ROMILIO ADRIAZOLA","CARAHUE",6499,9102]
[2071,5603,"ESCUELA BASICA SAN FRANCISCO","CARTAGENA",2071,5603]
[2068,5603,"ESCUELA CARMEN ROMERO AGUIRRE","CARTAGENA",2068,5603]
[2065,5603,"ESCUELA PRESIDENTE AGUIRRE CERDA","CARTAGENA",2065,5603]
[2066,5603,"LICEO EUGENIA SUBERCASEAUX","CARTAGENA",2066,5603]
[1998,5102,"ESCUELA ARTURO ECHAZARRETA LARRAIN","CASABLANCA",1998,5102]
[2005,5102,"ESCUELA BASICA LAGUNILLAS","CASABLANCA",2005,5102]
[1997,5102,"ESCUELA DOMINGO ORTIZ DE ROZAS","CASABLANCA",1997,5102]
[1999,5102,"ESCUELA MANUEL BRAVO REYES","CASABLANCA",1999,5102]
[2003,5102,"ESCUELA SAN PEDRO DE QUINTAY","CASABLANCA",2003,5102]
[8005,10201,"ESCUELA AYTUE","CASTRO",8005,10201]
[8041,10201,"ESCUELA DIFERENCIAL `ANTU- KAU`","CASTRO",8041,10201]
[8004,10201,"ESCUELA INES MUNOZ DE GARCIA","CASTRO",8004,10201]
[8003,10201,"ESCUELA LUIS URIBE DIAZ","CASTRO",8003,10201]
[22176,10201,"ESCUELA PADRE HURTADO","CASTRO",22176,10201]
[8012,10201,"ESCUELA RURAL ANA NELLY OYARZUN CARTES","CASTRO",8012,10201]
[8013,10201,"ESCUELA RURAL MIRTA OYARZO VERA","CASTRO",8013,10201]
[8027,10201,"ESCUELA RURAL OLINDA BORQUEZ BORQUEZ","CASTRO",8027,10201]
[8006,10201,"ESCUELA RURAL PEDRO VELAZQUEZ BONTES","CASTRO",8006,10201]
[22535,10201,"ESCUELA TERESA DE LOS ANDES","CASTRO",22535,10201]
[1358,5702,"ESCUELA BASICA EL NILHUE","CATEMU",1358,5702]
[1359,5702,"ESCUELA BASICA LOS CERRILLOS","CATEMU",1359,5702]
[1360,5702,"ESCUELA BASICA SANTA MARGARITA","CATEMU",1360,5702]
[1355,5702,"ESCUELA EL COBRE","CATEMU",1355,5702]
[1352,5702,"ESCUELA MARIA TERESA DEL CANTO","CATEMU",1352,5702]
[1353,5702,"ESCUELA SAN JOSE DE CATEMU","CATEMU",1353,5702]
[3544,7201,"COLEGIO BLANCO ENCALADA","CAUQUENES",3544,7201]
[3552,7201,"ESCUELA ADOLFO QUIROZ HERNANDEZ","CAUQUENES",3552,7201]
[3541,7201,"ESCUELA ANIBAL PINTO","CAUQUENES",3541,7201]
[3545,7201,"ESCUELA ARTISTICA BARRIO ESTACION","CAUQUENES",3545,7201]
[3537,7201,"ESCUELA ESPECIAL HORIZONTE","CAUQUENES",3537,7201]
[3546,7201,"ESCUELA INDEPENDENCIA","CAUQUENES",3546,7201]
[3551,7201,"ESCUELA LOS CONQUISTADORES","CAUQUENES",3551,7201]
[3555,7201,"ESCUELA OCTAVIO PALMA PEREZ","CAUQUENES",3555,7201]
[3573,7201,"ESCUELA PEDRO DE VALDIVIA","CAUQUENES",3573,7201]
[3549,7201,"ESCUELA PORONGO","CAUQUENES",3549,7201]
[3548,7201,"ESCUELA ROSITA OHIGGINS","CAUQUENES",3548,7201]
[3538,7201,"LICEO ANTONIO VARAS","CAUQUENES",3538,7201]
[25539,13102,"EJERCITO LIBERTADOR DE CERRILLOS","CERRILLOS",25539,13102]
[8519,13102,"ESCUELA BASICA PEDRO AGUIRRE CERDA","CERRILLOS",8519,13102]
[9875,13102,"ESCUELA CERRILLOS","CERRILLOS",9875,13102]
[9886,13102,"ESCUELA ESTRELLA REINA DE CHILE","CERRILLOS",9886,13102]
[9882,13102,"ESCUELA J.PRIETO VIAL","CERRILLOS",9882,13102]
[9874,13102,"ESCUELA LOTHAR KOMMER BRUGER","CERRILLOS",9874,13102]
[9888,13102,"ESCUELA SANTA ADELA","CERRILLOS",9888,13102]
[9865,13102,"LICEO POLIVALENTE DR. LUIS VARGAS SALCEDO","CERRILLOS",9865,13102]
[10116,13103,"COLEGIO NEPTUNO","CERRO NAVIA",10116,13103]
[10126,13103,"COMPLEJO EDUCACIONAL CERRO NAVIA","CERRO NAVIA",10126,13103]
[10074,13103,"ESCUELA ALIANZA","CERRO NAVIA",10074,13103]
[10107,13103,"ESCUELA BASICA PAULO FREIRE","CERRO NAVIA",10107,13103]
[10121,13103,"ESCUELA CIUDAD SANTO DOMINGO DE GUZMAN","CERRO NAVIA",10121,13103]
[10109,13103,"ESCUELA DOCTOR TREVISO GIRARDI TONELLI","CERRO NAVIA",10109,13103]
[24804,13103,"ESCUELA ESPECIAL SGTO.CADELARIA","CERRO NAVIA",24804,13103]
[10105,13103,"ESCUELA FEDERICO ACEVEDO SALAZAR","CERRO NAVIA",10105,13103]
[10099,13103,"ESCUELA GENERAL RENE ESCAURIAZA","CERRO NAVIA",10099,13103]
[10088,13103,"ESCUELA HERMINDA DE LA VICTORIA","CERRO NAVIA",10088,13103]
[10108,13103,"ESCUELA LEONARDO DA VINCI","CERRO NAVIA",10108,13103]
[10117,13103,"ESCUELA MARIA LUISA BOMBAL","CERRO NAVIA",10117,13103]
[10093,13103,"ESCUELA MILLAHUE","CERRO NAVIA",10093,13103]
[10122,13103,"ESCUELA PROF. MANUEL GUERRERO CEBALLOS","CERRO NAVIA",10122,13103]
[10098,13103,"ESCUELA PROVINCIA DE ARAUCO","CERRO NAVIA",10098,13103]
[10087,13103,"ESCUELA REPUBLICA DE CROACIA","CERRO NAVIA",10087,13103]
[10086,13103,"ESCUELA REPUBLICA DE ITALIA","CERRO NAVIA",10086,13103]
[10125,13103,"ESCUELA SARGENTO CANDELARIA","CERRO NAVIA",10125,13103]
[383,3201,"ESC. BAS. DIFERENCIAL JOSE LUIS OLIVARES A.","CHAÑARAL",383,3201]
[11033,3201,"ESCUELA BASICA ANGELINA SALAS OLIVARES","CHAÑARAL",11033,3201]
[380,3201,"ESCUELA BASICA DIEGO PORTALES PALAZUELOS","CHAÑARAL",380,3201]
[382,3201,"ESCUELA BASICA GASPAR CABRALES","CHAÑARAL",382,3201]
[13135,3201,"ESCUELA BASICA IGNACIO DOMEYKO","CHAÑARAL",13135,3201]
[381,3201,"ESCUELA BASICA PEDRO LUJAN","CHAÑARAL",381,3201]
[22083,10401,"ESCUELA BASICA ALMIRANTE JUAN JOSE LATORRE","CHAITEN",22083,10401]
[8309,10401,"ESCUELA RURAL AYACARA","CHAITEN",8309,10401]
[20342,7202,"ESCUELA ESPECIAL DE LENGUAJE POLHUIN","CHANCO",20342,7202]
[3636,7202,"ESCUELA LOANCO","CHANCO",3636,7202]
[3619,7202,"ESCUELA LOS HEROES","CHANCO",3619,7202]
[3622,7202,"ESCUELA PAHUIL","CHANCO",3622,7202]
[3621,7202,"ESCUELA SAN AMBROSIO","CHANCO",3621,7202]
[15754,6302,"CENTRO DE RECURSOS EDUCATIVO INTEGRARTE","CHEPICA",15754,6302]
[2532,6302,"COLEGIO LIBERTADOR O┤HIGGINS DE CHEPICA","CHEPICA",2532,6302]
[2539,6302,"ESCUELA LUIS ARTURO ZUNIGA FUENTES","CHEPICA",2539,6302]
[2542,6302,"ESCUELA LUZ MARIA CRESPO URETA DE KERESTEGIAN","CHEPICA",2542,6302]
[2540,6302,"ESCUELA MARIA MARTA DEL REAL CORREA","CHEPICA",2540,6302]
[17709,8103,"ESCUELA BALMACEDA SAAVEDRA L.","CHIGUAYANTE",17709,8103]
[4575,8103,"ESCUELA BASICA JOHN F. KENNEDY","CHIGUAYANTE",4575,8103]
[4586,8103,"ESCUELA BASICA MANQUIMAVIDA","CHIGUAYANTE",4586,8103]
[4591,8103,"ESCUELA BASICA REPUBLICA DE GRECIA","CHIGUAYANTE",4591,8103]
[4576,8103,"ESCUELA BELGICA","CHIGUAYANTE",4576,8103]
[4597,8103,"ESCUELA LA ESPERANZA","CHIGUAYANTE",4597,8103]
[4584,8103,"ESCUELA REPUBLICA FEDERAL ALEMANA","CHIGUAYANTE",4584,8103]
[4571,8103,"LICEO JOSE HIPOLITO SALAS Y TORO","CHIGUAYANTE",4571,8103]
[8398,11401,"ESC. LIBERTADOR BERNARDO O┤HIGGINS RIQUELME","CHILE CHICO",8398,11401]
[24216,11401,"ESCUELA BASICA DE CHILE CHICO","CHILE CHICO",24216,11401]
[3672,8401,"ESC. BASICA ARTURO MUTIZABAL SOTOMAYOR","CHILLAN",3672,8401]
[3678,8401,"ESCUELA 27 DE ABRIL","CHILLAN",3678,8401]
[3703,8401,"ESCUELA ANTONIO MACHADO","CHILLAN",3703,8401]
[3659,8401,"ESCUELA ARTURO MERINO BENITEZ","CHILLAN",3659,8401]
[3669,8401,"ESCUELA BÁSICA ROSITA O┤HIGGINS RIQUELME","CHILLAN",3669,8401]
[3681,8401,"ESCUELA BASICA CAPILLA COX","CHILLAN",3681,8401]
[3704,8401,"ESCUELA BASICA COLLIGUAY","CHILLAN",3704,8401]
[3697,8401,"ESCUELA BASICA CONFLUENCIA","CHILLAN",3697,8401]
[3653,8401,"ESCUELA BASICA DIEGO BARROS ARANA","CHILLAN",3653,8401]
[3664,8401,"ESCUELA BASICA EL TEJAR","CHILLAN",3664,8401]
[3675,8401,"ESCUELA BASICA JOSE MARIA CARO RODRIGUEZ","CHILLAN",3675,8401]
[3671,8401,"ESCUELA BASICA JUAN MADRID AZOLA","CHILLAN",3671,8401]
[3667,8401,"ESCUELA BASICA LA CASTILLA","CHILLAN",3667,8401]
[3677,8401,"ESCUELA BASICA LAS CANOAS","CHILLAN",3677,8401]
[3654,8401,"ESCUELA BASICA LOS HEROES","CHILLAN",3654,8401]
[3673,8401,"ESCUELA BASICA QUILAMAPU","CHILLAN",3673,8401]
[3685,8401,"ESCUELA BASICA QUINCHAMALI","CHILLAN",3685,8401]
[3670,8401,"ESCUELA BASICA REYES DE ESPANA","CHILLAN",3670,8401]
[3849,8401,"ESCUELA CAMILO HENRIQUEZ","CHILLAN",3849,8401]
[3649,8401,"ESCUELA ESPECIAL LAS ACACIAS","CHILLAN",3649,8401]
[3660,8401,"ESCUELA GABRIELA MISTRAL","CHILLAN",3660,8401]
[3707,8401,"ESCUELA LOS JARDINES DE LAUTARO","CHILLAN",3707,8401]
[3666,8401,"ESCUELA MARIA AMALIA SAAVEDRA MARTINEZ","CHILLAN",3666,8401]
[17892,8401,"ESCUELA MARTA COLVIN ANDRADE","CHILLAN",17892,8401]
[3668,8401,"ESCUELA PALESTINA","CHILLAN",3668,8401]
[3650,8401,"ESCUELA PARVULARIA FEDERICO FROEBEL","CHILLAN",3650,8401]
[3691,8401,"ESCUELA PAUL HARRIS","CHILLAN",3691,8401]
[17698,8401,"ESCUELA RAMÓN VINAY SEP┌LVEDA","CHILLAN",17698,8401]
[3658,8401,"ESCUELA REPUBLICA DE ISRAEL","CHILLAN",3658,8401]
[3662,8401,"ESCUELA REPUBLICA DE ITALIA","CHILLAN",3662,8401]
[3663,8401,"ESCUELA REPUBLICA DE MEXICO","CHILLAN",3663,8401]
[3674,8401,"ESCUELA REPUBLICA DE PORTUGAL","CHILLAN",3674,8401]
[3657,8401,"LICEO LIBERTADOR BERNARDO O`HIGGINS RIQUELME","CHILLAN",3657,8401]
[3709,8406,"ESCUELA BASICA LOS COLIGUES","CHILLAN VIEJO",3709,8406]
[3686,8406,"ESCUELA BASICA NEBUCO","CHILLAN VIEJO",3686,8406]
[3683,8406,"ESCUELA BASICA RUCAPEQUEN","CHILLAN VIEJO",3683,8406]
[18099,8406,"ESCUELA TOMAS LAGO","CHILLAN VIEJO",18099,8406]
[3656,8406,"LICEO POLIVALENTE JUAN PACHECO ALTAMIRANO","CHILLAN VIEJO",3656,8406]
[11263,6303,"CENTRO PARVULARIO DE CHIMBARONGO","CHIMBARONGO",11263,6303]
[2493,6303,"ESCUELA BAS. JOSE MIGUEL CARRERA VERDUGO","CHIMBARONGO",2493,6303]
[2501,6303,"ESCUELA BAS. PEDRO ETCHEVERRY","CHIMBARONGO",2501,6303]
[2489,6303,"ESCUELA BAS. VILLA CONVENTO VIEJO","CHIMBARONGO",2489,6303]
[2487,6303,"ESCUELA BAS.FERNANDO ARENAS ALMARZA","CHIMBARONGO",2487,6303]
[15790,6303,"ESCUELA ESPECIAL AYUDANDO A CRECER","CHIMBARONGO",15790,6303]
[2488,6303,"ESCUELA MUNICIPAL","CHIMBARONGO",2488,6303]
[2490,6303,"ESCUELA MUNICIPAL","CHIMBARONGO",2490,6303]
[2491,6303,"ESCUELA MUNICIPAL","CHIMBARONGO",2491,6303]
[2492,6303,"ESCUELA MUNICIPAL","CHIMBARONGO",2492,6303]
[2494,6303,"ESCUELA MUNICIPAL","CHIMBARONGO",2494,6303]
[2495,6303,"ESCUELA MUNICIPAL","CHIMBARONGO",2495,6303]
[2498,6303,"ESCUELA MUNICIPAL","CHIMBARONGO",2498,6303]
[2500,6303,"ESCUELA MUNICIPAL","CHIMBARONGO",2500,6303]
[2505,6303,"ESCUELA MUNICIPAL","CHIMBARONGO",2505,6303]
[2506,6303,"ESCUELA MUNICIPAL","CHIMBARONGO",2506,6303]
[2508,6303,"ESCUELA MUNICIPAL","CHIMBARONGO",2508,6303]
[2509,6303,"ESCUELA MUNICIPAL","CHIMBARONGO",2509,6303]
[2513,6303,"ESCUELA MUNICIPAL","CHIMBARONGO",2513,6303]
[6624,9121,"ESC. BASICA EL PROGRESO","CHOLCHOL",6624,9121]
[6599,9121,"ESCUELA BASICA COIHUE CURACO","CHOLCHOL",6599,9121]
[6586,9121,"LICEO JAMES MUNDELL","CHOLCHOL",6586,9121]
[22554,10203,"ESCUELA BASICA SAN CARLOS DE CHONCHI","CHONCHI",22554,10203]
[40369,10203,"ESCUELA DE EDUCACION ESPECIAL AMANECER","CHONCHI",40369,10203]
[8206,10203,"LICEO MANUEL JESUS ANDRADE BORQUEZ","CHONCHI",8206,10203]
[8391,11202,"ESCUELA EUSEBIO IBAR SCHEPELER","CISNES",8391,11202]
[8388,11202,"ESCUELA GUIDO GOMEZ MUNOZ","CISNES",8388,11202]
[8390,11202,"ESCUELA HAMBURGO","CISNES",8390,11202]
[4087,8403,"ESCUELA BASICA BUCHUPUREO","COBQUECURA",4087,8403]
[17741,8403,"ESCUELA REINO DE SUECIA","COBQUECURA",17741,8403]
[7753,10103,"ESCUELA BASICA FRONTERIZA JUAN SOLER MANFREDINI","COCHAMO",7753,10103]
[7760,10103,"ESCUELA RURAL RIO PUELO","COCHAMO",7760,10103]
[8408,11301,"ESC. BASICA HERNAN MERINO CORREA","COCHRANE",8408,11301]
[2234,6102,"COLEGIO JESUS ANDINO","CODEGUA",2234,6102]
[2235,6102,"COLEGIO MARIANO LATORRE","CODEGUA",2235,6102]
[2240,6102,"COLEGIO MUNICIPAL CRISTO DEL PARQUE","CODEGUA",2240,6102]
[2237,6102,"COLEGIO MUNICIPAL DE CALLEJONES","CODEGUA",2237,6102]
[2238,6102,"COLEGIO SANTA TERESA DE TUNCA","CODEGUA",2238,6102]
[2236,6102,"ESCUELA EUGENIO GARCIA FERNANDEZ","CODEGUA",2236,6102]
[4051,8404,"ESCUELA CLEMENTINA MAUREIRA ALMANZA","COELEMU",4051,8404]
[4059,8404,"ESCUELA FELIPE CUBILLOS SIGAL","COELEMU",4059,8404]
[4052,8404,"ESCUELA GUARILIHUE ALTO","COELEMU",4052,8404]
[18002,8404,"ESCUELA JOSE FRANCISCO PINO MEDINA","COELEMU",18002,8404]
[4050,8404,"ESCUELA MARIA TERESA MARCHANT CONTRERAS","COELEMU",4050,8404]
[4048,8404,"ESCUELA VILLA JESUS DE COELEMU","COELEMU",4048,8404]
[8348,11101,"ESCUELA BAQUEDANO","COIHAIQUE",8348,11101]
[8358,11101,"ESCUELA JOSE ANTOLIN SILVA ORMENO","COIHAIQUE",8358,11101]
[8353,11101,"ESCUELA NIEVES DEL SUR","COIHAIQUE",8353,11101]
[8349,11101,"ESCUELA PEDRO QUINTANA MANSILA","COIHAIQUE",8349,11101]
[8356,11101,"ESCUELA RURAL CON INTERNADO RIO BLANCO","COIHAIQUE",8356,11101]
[8355,11101,"ESCUELA RURAL PABLO NERUDA","COIHAIQUE",8355,11101]
[8361,11101,"ESCUELA RURAL VALLE DE LA LUNA","COIHAIQUE",8361,11101]
[8357,11101,"ESCUELA RURAL VALLE SIMPSON","COIHAIQUE",8357,11101]
[8346,11101,"ESCUELA VICTOR DOMINGO SILVA","COIHAIQUE",8346,11101]
[8352,11101,"LICEO REPUBLICA ARGENTINA","COIHAIQUE",8352,11101]
[3840,8405,"ESCUELA BASICA NIBLINTO","COIHUECO",3840,8405]
[3835,8405,"ESCUELA BRITANICA GUILLERMINA DRAKE WOOD","COIHUECO",3835,8405]
[3836,8405,"ESCUELA DOMITILA URREJOLA MENCHACA","COIHUECO",3836,8405]
[3855,8405,"ESCUELA GENERAL PEDRO LAGOS MARCHANT","COIHUECO",3855,8405]
[3841,8405,"ESCUELA GUARDIA MARINA ERNESTO RIQUELME","COIHUECO",3841,8405]
[3842,8405,"ESCUELA HEROES DE IQUIQUE","COIHUECO",3842,8405]
[3856,8405,"ESCUELA MANUEL MATUS HERMOSILLA","COIHUECO",3856,8405]
[18012,8405,"ESCUELA MARTA COLVIN ANDRADE","COIHUECO",18012,8405]
[3843,8405,"ESCUELA PORVENIR DE CATO","COIHUECO",3843,8405]
[3839,8405,"ESCUELA TALQUIPEN","COIHUECO",3839,8405]
[15728,6103,"COLEGIO MUNICIPAL HUALLILEN","COINCO",15728,6103]
[2407,6103,"ESCUELA MUNICIPAL CHILLEHUE","COINCO",2407,6103]
[2409,6103,"ESCUELA MUNICIPAL COPEQUEN","COINCO",2409,6103]
[2410,6103,"ESCUELA MUNICIPAL EL RULO","COINCO",2410,6103]
[3332,7402,"ESCUELA ANDRES BELLO","COLBUN",3332,7402]
[16468,7402,"ESCUELA BASICA DE COLBUN","COLBUN",16468,7402]
[3333,7402,"ESCUELA CARLOS DEL CAMPO RIVERA","COLBUN",3333,7402]
[3338,7402,"ESCUELA KURT MOLLER BOCHERENS","COLBUN",3338,7402]
[3330,7402,"ESCUELA LA FLORESTA","COLBUN",3330,7402]
[3345,7402,"ESCUELA LOMAS DE PUTAGAN","COLBUN",3345,7402]
[3329,7402,"ESCUELA MAULE SUR","COLBUN",3329,7402]
[3334,7402,"ESCUELA MONSENOR MANUEL LARRAIN E.","COLBUN",3334,7402]
[3335,7402,"ESCUELA PANIMAVIDA","COLBUN",3335,7402]
[3336,7402,"ESCUELA RARI","COLBUN",3336,7402]
[178,1403,"LICEO TECNICO PROFESIONAL COLCHANE","COLCHANE",178,1403]
[10404,13301,"ANDALIEN DE COLINA","COLINA",10404,13301]
[26003,13301,"ESC. ESPECIAL ELSA MATILDE ULRICH JARA","COLINA",26003,13301]
[10409,13301,"ESC.BASICA FRANCISCO PETRINOVIC KARLOVAC","COLINA",10409,13301]
[10407,13301,"ESCUELA BASICA ALGARROBAL","COLINA",10407,13301]
[10400,13301,"ESCUELA BASICA MARCOS GOOYCOLEA CORTES","COLINA",10400,13301]
[10410,13301,"ESCUELA BASICA SAN VICENTE DE LO ARCAYA","COLINA",10410,13301]
[10411,13301,"ESCUELA BASICA SANTA MARTA DE LIRAY","COLINA",10411,13301]
[10401,13301,"ESCUELA BASICA SANTA TERESA DEL CARMELO","COLINA",10401,13301]
[31154,13301,"ESCUELA CAMINO ALTO","COLINA",31154,13301]
[10403,13301,"ESCUELA PREMIO NOBEL PABLO NERUDA","COLINA",10403,13301]
[5292,9202,"ESCUELA BASICA MIGUEL HUENTELEN","COLLIPULLI",5292,9202]
[5286,9202,"ESCUELA BASICA VICTOR DURAN PEREZ","COLLIPULLI",5286,9202]
[5284,9202,"ESCUELA BENJAMIN FRANKLIN","COLLIPULLI",5284,9202]
[19918,9202,"ESCUELA ESPECIAL ERICO HORNUNG","COLLIPULLI",19918,9202]
[5288,9202,"ESCUELA MICHIGAN EL AMANECER","COLLIPULLI",5288,9202]
[5289,9202,"ESCUELA MININCO","COLLIPULLI",5289,9202]
[5290,9202,"ESCUELA NICOLAS PEREZ CARDENAS","COLLIPULLI",5290,9202]
[5283,9202,"ESCUELA THOMAS ALBA EDISON","COLLIPULLI",5283,9202]
[2389,6104,"COLEGIO NUESTRA SEÑORA DE LORETO","COLTAUCO",2389,6104]
[2390,6104,"COLEGIO QUILLAYQUEN RINCONADA DE PARRAL","COLTAUCO",2390,6104]
[2392,6104,"ESC. LUCILA GODOY ALCAYAGA","COLTAUCO",2392,6104]
[2391,6104,"ESC. SUBTENIENTE JULIO MONTT SALAMANCA","COLTAUCO",2391,6104]
[2397,6104,"ESCUELA CAPITAN IGNACIO CARRERA PINTO","COLTAUCO",2397,6104]
[2388,6104,"ESCUELA MUNIC.SBTE LUIS CRUZ MARTINEZ","COLTAUCO",2388,6104]
[2396,6104,"ESCUELA MUNICIPAL DE RINCONADA DE IDAHUE","COLTAUCO",2396,6104]
[2395,6104,"ESCUELA MUNICIPAL DE VINA LA CRUZ","COLTAUCO",2395,6104]
[2394,6104,"ESCUELA MUNICIPAL JOSEFINA VIAL DE VIAL","COLTAUCO",2394,6104]
[2387,6104,"ESCUELA MUNICIPAL OSVALDO RUIZ GARCIA","COLTAUCO",2387,6104]
[2398,6104,"ESCUELA SUBTTE. ARTURO PEREZ CANTO","COLTAUCO",2398,6104]
[847,4302,"ESCUELA BASICA AMERICA","COMBARBALA",847,4302]
[851,4302,"ESCUELA BASICA ARTURO PEREZ CANTO","COMBARBALA",851,4302]
[849,4302,"ESCUELA BASICA JUANITA FERNANDEZ SOLAR","COMBARBALA",849,4302]
[852,4302,"ESCUELA BASICA PEDRO DE VALDIVIA","COMBARBALA",852,4302]
[4564,8101,"COLEGIO BICENTENARIO REP┌BLICA DEL BRASIL","CONCEPCION",4564,8101]
[4548,8101,"COLEGIO BIOBÍO","CONCEPCION",4548,8101]
[4574,8101,"COLEGIO ESPAÑA","CONCEPCION",4574,8101]
[4572,8101,"COLEGIO GRAN BRETAÑA","CONCEPCION",4572,8101]
[4588,8101,"COLEGIO JUAN GREGORIO LAS HERAS","CONCEPCION",4588,8101]
[4531,8101,"COLEGIO MARINA DE CHILE","CONCEPCION",4531,8101]
[4551,8101,"ESCUELA BÁSICA COM┌N HOSPITAL","CONCEPCION",4551,8101]
[4592,8101,"ESCUELA BÁSICA IRENE FREI DE CID","CONCEPCION",4592,8101]
[4614,8101,"ESCUELA BASICA AGUA DE LA GLORIA","CONCEPCION",4614,8101]
[4622,8101,"ESCUELA BASICA FUNDO CHANCO","CONCEPCION",4622,8101]
[4603,8101,"ESCUELA BASICA LAGOS DE CHILE","CONCEPCION",4603,8101]
[4613,8101,"ESCUELA BASICA LAUTARO","CONCEPCION",4613,8101]
[4579,8101,"ESCUELA BASICA RENE LOUVEL BERT","CONCEPCION",4579,8101]
[4569,8101,"ESCUELA DIEGO PORTALES PALAZUELOS","CONCEPCION",4569,8101]
[4543,8101,"ESCUELA ESPECIAL CHILE ESPAÑA","CONCEPCION",4543,8101]
[4582,8101,"ESCUELA ESTHER HUNNEUS DE CLARO","CONCEPCION",4582,8101]
[4612,8101,"ESCUELA LUIS ALFREDO MUÑOZ BURBOA","CONCEPCION",4612,8101]
[4581,8101,"ESCUELA OSCAR CASTRO ZUNIGA","CONCEPCION",4581,8101]
[4609,8101,"ESCUELA PALESTINA DE PALOMARES","CONCEPCION",4609,8101]
[4540,8101,"ESCUELA PARVULARIA BLANCA ESTELA","CONCEPCION",4540,8101]
[4565,8101,"LICEO DOMINGO SANTA MARÍA","CONCEPCION",4565,8101]
[4589,8101,"LICEO LUCERO GONZALEZ","CONCEPCION",4589,8101]
[4585,8101,"LICEO REBECA MATTE BELLO","CONCEPCION",4585,8101]
[4577,8101,"LICEO REP┌BLICA DE ISRAEL","CONCEPCION",4577,8101]
[4563,8101,"LICEO REP┌BLICA DEL ECUADOR","CONCEPCION",4563,8101]
[10280,13104,"CENTRO EDUC. POETA EUSEBIO LILLO","CONCHALI",10280,13104]
[10279,13104,"ESCUELA ALLIPEN","CONCHALI",10279,13104]
[10271,13104,"ESCUELA ARAUCARIAS DE CHILE","CONCHALI",10271,13104]
[10281,13104,"ESCUELA ATENEA","CONCHALI",10281,13104]
[10288,13104,"ESCUELA BASICA LIKAN-ANTAI","CONCHALI",10288,13104]
[10301,13104,"ESCUELA CAMILO HENRIQUEZ","CONCHALI",10301,13104]
[10263,13104,"ESCUELA D-114","CONCHALI",10263,13104]
[10266,13104,"ESCUELA DRA.ELOISA DIAZ INSUNZA","CONCHALI",10266,13104]
[10293,13104,"ESCUELA ESP. HUMBERTO ARANDA IRRIBARREN","CONCHALI",10293,13104]
[10265,13104,"ESCUELA HORACIO JOHNSON GANA","CONCHALI",10265,13104]
[10278,13104,"ESCUELA PEDRO AGUIRRE CERDA","CONCHALI",10278,13104]
[10264,13104,"ESCUELA SOL NACIENTE","CONCHALI",10264,13104]
[10260,13104,"ESCUELA UNESCO","CONCHALI",10260,13104]
[10273,13104,"ESCUELA VALLE DEL INCA","CONCHALI",10273,13104]
[10269,13104,"LICEO MUNC.ALMIRANTE GALVARINO RIVEROS","CONCHALI",10269,13104]
[10251,13104,"LICEO POETA FEDERICO GARCIA LORCA","CONCHALI",10251,13104]
[10253,13104,"LICEO POLIV. ABDON CIFUENTES","CONCHALI",10253,13104]
[1699,5103,"ESCUELA BASICA IRMA SALAS SILVA","CONCON",1699,5103]
[1474,5103,"ESCUELA BASICA PUENTE COLMO","CONCON",1474,5103]
[1689,5103,"ESCUELA ORO NEGRO","CONCON",1689,5103]
[16506,7102,"ESCUELA CHACARILLAS","CONSTITUCION",16506,7102]
[3185,7102,"ESCUELA COSTA BLANCA","CONSTITUCION",3185,7102]
[3166,7102,"ESCUELA ENRIQUE DONN MULLER","CONSTITUCION",3166,7102]
[3174,7102,"ESCUELA LAS CORRIENTES","CONSTITUCION",3174,7102]
[3191,7102,"ESCUELA SANTA AURORA DE CARRIZAL","CONSTITUCION",3191,7102]
[3168,7102,"ESCUELA SUPERIOR NUEVA BILBAO","CONSTITUCION",3168,7102]
[3173,7102,"LICEO RURAL ENRIQUE MAC IVER","CONSTITUCION",3173,7102]
[3172,7102,"LICEO RURAL PUTU","CONSTITUCION",3172,7102]
[3170,7102,"MAESTRA M.FRESIA HORMAZABAL LETELIER","CONSTITUCION",3170,7102]
[5166,8204,"ESCUELA CALEBU","CONTULMO",5166,8204]
[5154,8204,"ESCUELA SAN LUIS DE CONTULMO","CONTULMO",5154,8204]
[417,3101,"COLEGIO BUEN PASTOR","COPIAPO",417,3101]
[404,3101,"ESC.EDUC.DIFERENCIAL MARIA LUZ LANZA PIZARRO","COPIAPO",404,3101]
[416,3101,"ESCUELA ABRAHAM SEPULVEDA PIZARRO","COPIAPO",416,3101]
[401,3101,"ESCUELA BERNARDO O HIGGINS","COPIAPO",401,3101]
[421,3101,"ESCUELA BRUNO ZAVALA FREDES","COPIAPO",421,3101]
[13162,3101,"ESCUELA DIFERENCIAL PUKARA","COPIAPO",13162,3101]
[13154,3101,"ESCUELA EL CHANAR","COPIAPO",13154,3101]
[13163,3101,"ESCUELA EL PALOMAR","COPIAPO",13163,3101]
[420,3101,"ESCUELA FUNDICION PAIPOTE","COPIAPO",420,3101]
[419,3101,"ESCUELA HERNAN MARQUEZ HUERTA","COPIAPO",419,3101]
[418,3101,"ESCUELA ISABEL PENA MORALES","COPIAPO",418,3101]
[407,3101,"ESCUELA JESUS FERNANDEZ HIDALGO","COPIAPO",407,3101]
[410,3101,"ESCUELA JOSE MANSO DE VELASCO","COPIAPO",410,3101]
[413,3101,"ESCUELA LAS BRISAS","COPIAPO",413,3101]
[411,3101,"ESCUELA LAS CANTERAS","COPIAPO",411,3101]
[403,3101,"ESCUELA LAURA ROBLES SILVA","COPIAPO",403,3101]
[405,3101,"ESCUELA LOS ESTANDARTES","COPIAPO",405,3101]
[427,3101,"ESCUELA LUIS CRUZ MARTINEZ","COPIAPO",427,3101]
[13133,3101,"ESCUELA MANUEL RODRIGUEZ","COPIAPO",13133,3101]
[408,3101,"ESCUELA PEDRO LEON GALLO","COPIAPO",408,3101]
[423,3101,"ESCUELA SAN PEDRO","COPIAPO",423,3101]
[406,3101,"ESCUELA VICENTE SEPULVEDA ROJO","COPIAPO",406,3101]
[630,4102,"COLEGIO LA HERRADURA","COQUIMBO",630,4102]
[629,4102,"COLEGIO PABLO NERUDA","COQUIMBO",629,4102]
[617,4102,"COLEGIO SANTA CECILIA","COQUIMBO",617,4102]
[626,4102,"ESCUELA BASICA DAVID LEON TAPIA","COQUIMBO",626,4102]
[632,4102,"ESCUELA BASICA MANUEL DE SALAS","COQUIMBO",632,4102]
[621,4102,"ESCUELA BASICA MARIO MUNOZ SILVA","COQUIMBO",621,4102]
[13557,4102,"ESCUELA BASICA REPUBLICA DE ITALIA","COQUIMBO",13557,4102]
[616,4102,"ESCUELA CARDENAL JOSE MARIA CARO","COQUIMBO",616,4102]
[615,4102,"ESCUELA COQUIMBO","COQUIMBO",615,4102]
[628,4102,"ESCUELA DE PENUELAS","COQUIMBO",628,4102]
[643,4102,"ESCUELA DE TAMBILLOS","COQUIMBO",643,4102]
[612,4102,"ESCUELA GUILLERMO CERECEDA","COQUIMBO",612,4102]
[620,4102,"ESCUELA JOSE ALFARO ALFARO","COQUIMBO",620,4102]
[13562,4102,"ESCUELA JUAN PABLO II","COQUIMBO",13562,4102]
[637,4102,"ESCUELA LUCILA GODOY ALCAYAGA","COQUIMBO",637,4102]
[13560,4102,"ESCUELA PADRE ALBERTO HURTADO CRUCHAGA","COQUIMBO",13560,4102]
[614,4102,"ESCUELA PRESIDENTE ANIBAL PINTO","COQUIMBO",614,4102]
[13559,4102,"ESCUELA REPUBLICA DE GRECIA","COQUIMBO",13559,4102]
[631,4102,"ESCUELA SAN RAFAEL","COQUIMBO",631,4102]
[618,4102,"ESCUELA SANTO TOMAS DE AQUINO","COQUIMBO",618,4102]
[625,4102,"ESCUELA TOMASA OLIVARES CAAMANO","COQUIMBO",625,4102]
[4994,8102,"ESCUELA ADELAIDA MIGUIELES SOTO","CORONEL",4994,8102]
[4990,8102,"ESCUELA AMBROSIO O┤HIGGINS","CORONEL",4990,8102]
[5001,8102,"ESCUELA ARTURO HUGHES CERNA","CORONEL",5001,8102]
[4987,8102,"ESCUELA BASICA JAVIERA CARRERA","CORONEL",4987,8102]
[5006,8102,"ESCUELA BASICA PATAGUAL","CORONEL",5006,8102]
[4985,8102,"ESCUELA BASICA PLAYAS NEGRAS","CORONEL",4985,8102]
[4999,8102,"ESCUELA BASICA RAMON FREIRE SERRANO","CORONEL",4999,8102]
[5005,8102,"ESCUELA ESCUADRON","CORONEL",5005,8102]
[5003,8102,"ESCUELA FRANCISCO COLOANE","CORONEL",5003,8102]
[4997,8102,"ESCUELA JORGE ROJAS MIRANDA","CORONEL",4997,8102]
[5002,8102,"ESCUELA JUAN JOSE LATORRE BENAVENTE","CORONEL",5002,8102]
[11398,8102,"ESCUELA MAULE","CORONEL",11398,8102]
[4995,8102,"ESCUELA OCTAVIO SALINAS CARIAGA","CORONEL",4995,8102]
[4988,8102,"ESCUELA RAFAEL SOTOMAYOR BAEZA","CORONEL",4988,8102]
[4992,8102,"ESCUELA REMIGIO CASTRO ABURTO","CORONEL",4992,8102]
[4991,8102,"ESCUELA REPUBLICA DE FRANCIA","CORONEL",4991,8102]
[4986,8102,"ESCUELA ROSA MEDEL AGUILERA","CORONEL",4986,8102]
[4998,8102,"ESCUELA ROSA YANEZ RODRIGUEZ","CORONEL",4998,8102]
[4984,8102,"ESCUELA ROSITA RENARD","CORONEL",4984,8102]
[4989,8102,"ESCUELA VICTOR DOMINGO SILVA","CORONEL",4989,8102]
[4996,8102,"ESCUELA VISTA HERMOSA","CORONEL",4996,8102]
[7016,14102,"ESCUELA BASICA DE CORRAL","CORRAL",7016,14102]
[7026,14102,"ESCUELA RURAL CHAIHUIN","CORRAL",7026,14102]
[6005,9103,"ESCUELA AURORA DE CHILE","CUNCO",6005,9103]
[5960,9103,"ESCUELA BASICA LAS HORTENCIAS","CUNCO",5960,9103]
[5990,9103,"ESCUELA BASICA QUECHEREHUE","CUNCO",5990,9103]
[5970,9103,"ESCUELA VIDA Y PAZ","CUNCO",5970,9103]
[5959,9103,"LICEO ARTURO VALENZUELA","CUNCO",5959,9103]
[5957,9103,"LICEO MUNICIPAL ATENEA","CUNCO",5957,9103]
[5353,9203,"ESCUELA BASICA REPUBLICA DE MEXICO","CURACAUTIN",5353,9203]
[5345,9203,"ESCUELA LUIS CRUZ MARTINEZ","CURACAUTIN",5345,9203]
[5346,9203,"ESCUELA OSVALDO FUENTES BARRERA","CURACAUTIN",5346,9203]
[5347,9203,"ESCUELA PATRICIO CHAVEZ SOTO","CURACAUTIN",5347,9203]
[5344,9203,"LICEO LAS ARAUCARIAS","CURACAUTIN",5344,9203]
[25642,13503,"ESCUELA BAS. MUNIC. CUYUNCAVI","CURACAVI",25642,13503]
[10842,13503,"ESCUELA BASICA VALLE DE PUANGUE","CURACAVI",10842,13503]
[10848,13503,"ESCUELA ELIECER PEREZ VARGAS","CURACAVI",10848,13503]
[10846,13503,"ESCUELA FERNANDO CARVAJAL PINTO","CURACAVI",10846,13503]
[10844,13503,"ESCUELA SAN JOSE OBRERO DE CURACAVI","CURACAVI",10844,13503]
[8165,10204,"ESCUELA RURAL EDUARDO FREI MONTALVA","CURACO DE VELEZ",8165,10204]
[8169,10204,"ESCUELA RURAL HUYAR ALTO","CURACO DE VELEZ",8169,10204]
[8170,10204,"ESCUELA RURAL SAN JAVIER","CURACO DE VELEZ",8170,10204]
[8162,10204,"LICEO ALFREDO DEL CARMEN BARRIA OYARZUN","CURACO DE VELEZ",8162,10204]
[5090,8205,"ESCUELA BUENA ESPERANZA","CURANILAHUE",5090,8205]
[5103,8205,"ESCUELA COLICO NORTE","CURANILAHUE",5103,8205]
[5087,8205,"ESCUELA COLICO SUR","CURANILAHUE",5087,8205]
[18139,8205,"ESCUELA DE LENGUAJE RAYEN-ANTU","CURANILAHUE",18139,8205]
[5091,8205,"ESCUELA GABRIELA MISTRAL","CURANILAHUE",5091,8205]
[5093,8205,"ESCUELA INDEPENDENCIA","CURANILAHUE",5093,8205]
[5088,8205,"ESCUELA PABLO NERUDA","CURANILAHUE",5088,8205]
[5085,8205,"ESCUELA RAMIRO ROA GONZALEZ","CURANILAHUE",5085,8205]
[5101,8205,"ESCUELA SAN JOSE DE COLICO","CURANILAHUE",5101,8205]
[5094,8205,"ESCUELA SANTA TERESA DE LOS ANDES","CURANILAHUE",5094,8205]
[6027,9104,"COMPLEJO EDUCACIONAL MONSEÑOR FRCO. VALDES S","CURARREHUE",6027,9104]
[6031,9104,"ESCUELA EL SANTILLO","CURARREHUE",6031,9104]
[6030,9104,"ESCUELA JERONIMO NECULPAN","CURARREHUE",6030,9104]
[6036,9104,"ESCUELA LICANCURA","CURARREHUE",6036,9104]
[6029,9104,"ESCUELA RUCA MANKE","CURARREHUE",6029,9104]
[3209,7103,"ESCUELA ELENA ARMIJO MORALES","CUREPTO",3209,7103]
[3206,7103,"ESCUELA FRAY PEDRO ARMENGOL VALENZUELA","CUREPTO",3206,7103]
[3240,7103,"ESCUELA GASPAR HERRERA HERRERA","CUREPTO",3240,7103]
[3207,7103,"ESCUELA PEDRO ANTONIO GONZALEZ","CUREPTO",3207,7103]
[2734,7301,"COLEGIO ALESSANDRI","CURICO",2734,7301]
[16715,7301,"COLEGIO EL BOLDO","CURICO",16715,7301]
[2737,7301,"COLEGIO POLIVALENTE JAPÓN","CURICO",2737,7301]
[16747,7301,"COLEGIO RAUQUEN CAMPO","CURICO",16747,7301]
[2742,7301,"ESC.REPUBLICA ORIENTAL DEL URUGUAY","CURICO",2742,7301]
[2749,7301,"ESCUELA AGUAS NEGRAS","CURICO",2749,7301]
[2745,7301,"ESCUELA CATALUNA","CURICO",2745,7301]
[2756,7301,"ESCUELA DIEGO PORTALES P.","CURICO",2756,7301]
[2776,7301,"ESCUELA EL MAITEN","CURICO",2776,7301]
[2741,7301,"ESCUELA ERNESTO CASTRO ARELLANO","CURICO",2741,7301]
[2744,7301,"ESCUELA ESPANA","CURICO",2744,7301]
[2730,7301,"ESCUELA ESPECIAL CURICO","CURICO",2730,7301]
[2740,7301,"ESCUELA GRECIA","CURICO",2740,7301]
[2780,7301,"ESCUELA HOLANDA","CURICO",2780,7301]
[2754,7301,"ESCUELA INTERNADO POTRERO GRANDE","CURICO",2754,7301]
[2764,7301,"ESCUELA ISLA DE MARCHANT","CURICO",2764,7301]
[2761,7301,"ESCUELA LA OBRA","CURICO",2761,7301]
[2767,7301,"ESCUELA LOS CRISTALES","CURICO",2767,7301]
[2755,7301,"ESCUELA MARIA OLGA FIGUEROA LEYTON","CURICO",2755,7301]
[2758,7301,"ESCUELA OSVALDO CORREA FUENZALIDA","CURICO",2758,7301]
[2771,7301,"ESCUELA PABLO NERUDA","CURICO",2771,7301]
[16460,7301,"ESCUELA PADRE ALBERTO HURTADO","CURICO",16460,7301]
[2736,7301,"ESCUELA PALESTINA","CURICO",2736,7301]
[2735,7301,"ESCUELA PRESIDENTE J.M.BALMACEDA","CURICO",2735,7301]
[2765,7301,"ESCUELA RAMON FREIRE","CURICO",2765,7301]
[2748,7301,"ESCUELA REPUBLICA ARGENTINA","CURICO",2748,7301]
[2738,7301,"ESCUELA REPUBLICA DE BRASIL","CURICO",2738,7301]
[2763,7301,"ESCUELA REPUBLICA DE ITALIA","CURICO",2763,7301]
[2753,7301,"ESCUELA REPUBLICA ESTADOS UNIDOS","CURICO",2753,7301]
[2747,7301,"ESCUELA SAN ANTONIO","CURICO",2747,7301]
[2766,7301,"ESCUELA VICTOR VERGARA CAMPOS","CURICO",2766,7301]
[8161,10205,"ESCUELA BASICA DALCAHUE","DALCAHUE",8161,10205]
[8112,10205,"ESCUELA RURAL JUAN VICTORINO TANGOL","DALCAHUE",8112,10205]
[8147,10205,"ESCUELA RURAL MALLINLEMU","DALCAHUE",8147,10205]
[386,3202,"ESCUELA ALIRO LAMAS CASTILLO","DIEGO DE ALMAGRO",386,3202]
[13170,3202,"ESCUELA BASICA SARA CORTES CORTES","DIEGO DE ALMAGRO",13170,3202]
[3820,8409,"ESCUELA BULI-CASERIO","ÑIQUEN",3820,8409]
[3799,8409,"ESCUELA CHACAY","ÑIQUEN",3799,8409]
[3818,8409,"ESCUELA COLVINDO","ÑIQUEN",3818,8409]
[3801,8409,"ESCUELA NIQUEN","ÑIQUEN",3801,8409]
[3815,8409,"ESCUELA PUERTAS DE VIRGUIN","ÑIQUEN",3815,8409]
[3798,8409,"ESCUELA SAN JORGE DE NIQUEN","ÑIQUEN",3798,8409]
[3804,8409,"ESCUELA ZEMITA","ÑIQUEN",3804,8409]
[3802,8409,"LICEO SAN GREGORIO","ÑIQUEN",3802,8409]
[3800,8409,"LICEO TIUQUILEMU","ÑIQUEN",3800,8409]
[2419,6105,"COLEGIO JULIO SILVA LAZO","DOÑIHUE",2419,6105]
[2414,6105,"COLEGIO MUNICIPAL LA ISLA","DOÑIHUE",2414,6105]
[2416,6105,"COLEGIO REPUBLICA DE CHILE","DOÑIHUE",2416,6105]
[2413,6105,"ESC. DE PARVULOS MIS PRIMEROS PASOS","DOÑIHUE",2413,6105]
[2417,6105,"ESCUELA CERRILLOS","DOÑIHUE",2417,6105]
[2412,6105,"ESCUELA LAURA MATUS MELENDEZ","DOÑIHUE",2412,6105]
[2415,6105,"ESCUELA LO MIRANDA","DOÑIHUE",2415,6105]
[2420,6105,"ESCUELA PLAZUELA","DOÑIHUE",2420,6105]
[24959,13120,"COMPL.EDUCACIONAL BRIGIDA WALKER ANEXO","ÑUÑOA",24959,13120]
[9084,13120,"ESC.PRESIDENTE EDUARDO FREI MONTALVA","ÑUÑOA",9084,13120]
[9086,13120,"ESCUELA AURORA DE CHILE","ÑUÑOA",9086,13120]
[9070,13120,"ESCUELA BENJAMIN CLARO VELASCO","ÑUÑOA",9070,13120]
[9128,13120,"ESCUELA DE ED.DIFERENCIAL HELLEN KELLER","ÑUÑOA",9128,13120]
[9083,13120,"ESCUELA DIFERENCIAL MUNICIPAL AMAPOLAS","ÑUÑOA",9083,13120]
[9102,13120,"ESCUELA GUILLERMO ZANARTU IRIGOYEN","ÑUÑOA",9102,13120]
[9131,13120,"ESCUELA JUAN MOYA MORALES","ÑUÑOA",9131,13120]
[9097,13120,"ESCUELA REPUBLICA DE COSTA RICA","ÑUÑOA",9097,13120]
[9091,13120,"ESCUELA REPUBLICA DE FRANCIA","ÑUÑOA",9091,13120]
[9073,13120,"LICEO CARMELA SILVA DONOSO","ÑUÑOA",9073,13120]
[9078,13120,"LICEO LENKA FRANULIC","ÑUÑOA",9078,13120]
[9100,13120,"LICEO REPUBLICA DE SIRIA","ÑUÑOA",9100,13120]
[12251,13105,"COLEGIO BATALLA DE LA CONCEPCION","EL BOSQUE",12251,13105]
[9713,13105,"COMPLEJO EDUCACIONAL FELIPE HERRERA LANE","EL BOSQUE",9713,13105]
[24822,13105,"ESC. BAS. PDTE. SALVADOR ALLENDE G.","EL BOSQUE",24822,13105]
[9698,13105,"ESCUELA BASICA AVIADORES","EL BOSQUE",9698,13105]
[10555,13105,"ESCUELA BASICA BASE EL BOSQUE","EL BOSQUE",10555,13105]
[9714,13105,"ESCUELA BASICA JOSE MARTI","EL BOSQUE",9714,13105]
[9702,13105,"ESCUELA BASICA MARIO ARCE GATICA","EL BOSQUE",9702,13105]
[9718,13105,"ESCUELA BASICA PAUL HARRIS","EL BOSQUE",9718,13105]
[9715,13105,"ESCUELA BASICA VILLA SANTA ELENA","EL BOSQUE",9715,13105]
[10559,13105,"ESCUELA BERNARDO LEIGHTON","EL BOSQUE",10559,13105]
[9717,13105,"ESCUELA CIUDAD DE LYON","EL BOSQUE",9717,13105]
[10561,13105,"ESCUELA CLAUDIO ARRAU LEON","EL BOSQUE",10561,13105]
[9728,13105,"ESCUELA DIFERENCIAL PARA NINOS SORDOS","EL BOSQUE",9728,13105]
[10557,13105,"ESCUELA GENERAL ALBERTO A. BACHELET MARTINEZ","EL BOSQUE",10557,13105]
[10553,13105,"ESCUELA MARCIAL MARTINEZ FERRARI","EL BOSQUE",10553,13105]
[9721,13105,"ESCUELA NEMESIO ANTUNEZ","EL BOSQUE",9721,13105]
[10568,13105,"ESCUELA ORLANDO LETELIER","EL BOSQUE",10568,13105]
[3914,8407,"ESCUELA BERNARDINO MUNOZ GONZALEZ","EL CARMEN",3914,8407]
[3935,8407,"ESCUELA DE SAN VICENTE ALTO","EL CARMEN",3935,8407]
[3912,8407,"ESCUELA DEL CARMEN SAN MARTÍN OTÁROLA","EL CARMEN",3912,8407]
[18006,8407,"ESCUELA ELISE MOTTART","EL CARMEN",18006,8407]
[31097,8407,"ESCUELA ESPECIAL DE LENGUAJE MUNICIPAL EL CARMEN","EL CARMEN",31097,8407]
[3922,8407,"ESCUELA MATA REDONDA","EL CARMEN",3922,8407]
[3913,8407,"ESCUELA NAVIDAD-TREHUALEMU","EL CARMEN",3913,8407]
[3910,8407,"ESCUELA VIRGEN DEL CARMEN","EL CARMEN",3910,8407]
[10737,13602,"ESC. BASICA JAVIERA CARRERA VERDUGO","EL MONTE",10737,13602]
[10740,13602,"ESCUELA CHINIGUE EL CRISTO","EL MONTE",10740,13602]
[10741,13602,"ESCUELA EL REMANSO","EL MONTE",10741,13602]
[10738,13602,"ESCUELA REPUBLICA DE HONDURAS","EL MONTE",10738,13602]
[10736,13602,"ESCUELA REPUBLICA DEL ECUADOR","EL MONTE",10736,13602]
[10735,13602,"LICEO POLIV. LUIS HUMBERTO ACOSTA GAY","EL MONTE",10735,13602]
[2078,5604,"COMPLEJO EDUCACIONAL CLARA SOLOVERA","EL QUISCO",2078,5604]
[2081,5604,"ESCUELA EL TOTORAL","EL QUISCO",2081,5604]
[2079,5604,"ESCUELA POETA NERUDA DE ISLA NEGRA","EL QUISCO",2079,5604]
[2075,5605,"COLEGIO EL TABO","EL TABO",2075,5605]
[2074,5605,"ESCUELA BASICA LAS CRUCES","EL TABO",2074,5605]
[3128,7104,"LICEO SAN IGNACIO","EMPEDRADO",3128,7104]
[5375,9204,"ESCUELA BASICA SALVADOR ALLENDE","ERCILLA",5375,9204]
[5386,9204,"ESCUELA BASICA TEMOCUICUI","ERCILLA",5386,9204]
[5378,9204,"ESCUELA BASICA TEODOCIO URRUTIA","ERCILLA",5378,9204]
[5385,9204,"ESCUELA CHACAIMAPU","ERCILLA",5385,9204]
[5382,9204,"ESCUELA MILLALEVIA","ERCILLA",5382,9204]
[5374,9204,"LICEO ALONSO DE ERCILLA Y ZUÑIGA","ERCILLA",5374,9204]
[9861,13106,"CENTRO EDUC.MUNIC. DR. AMADOR NECHME R.","ESTACION CENTRAL",9861,13106]
[8537,13106,"ESCUELA ARNALDO FALABELLA","ESTACION CENTRAL",8537,13106]
[8544,13106,"ESCUELA BÁSICA ARTURO ALESSANDRI PALMA","ESTACION CENTRAL",8544,13106]
[8558,13106,"ESCUELA BÁSICA HUMBERTO VALENZUELA GARCÍA","ESTACION CENTRAL",8558,13106]
[9879,13106,"ESCUELA BASICA","ESTACION CENTRAL",9879,13106]
[9880,13106,"ESCUELA BASICA JAPON","ESTACION CENTRAL",9880,13106]
[9873,13106,"ESCUELA BASICA PACTO ANDINO","ESTACION CENTRAL",9873,13106]
[9872,13106,"ESCUELA BASICA PROF.RAMON DEL RIO","ESTACION CENTRAL",9872,13106]
[9869,13106,"ESCUELA BASICA REPUBLICA DE FRANCIA","ESTACION CENTRAL",9869,13106]
[8579,13106,"ESCUELA BASICA UNION LATINOAMERICANA","ESTACION CENTRAL",8579,13106]
[8521,13106,"ESCUELA CARLOS CONDELL DE LA HAZA","ESTACION CENTRAL",8521,13106]
[8556,13106,"ESCUELA REPUBLICA DE AUSTRIA","ESTACION CENTRAL",8556,13106]
[8518,13106,"LICEO ESTACION CENTRAL","ESTACION CENTRAL",8518,13106]
[4879,8104,"ESCUELA BASICA PUENTE SIETE","FLORIDA",4879,8104]
[4890,8104,"ESCUELA BASICA VILLAMAVIDA","FLORIDA",4890,8104]
[4873,8104,"ESCUELA RAHUIL","FLORIDA",4873,8104]
[18112,8104,"LICEO INES ENRIQUEZ FRODDEN","FLORIDA",18112,8104]
[6183,9105,"ESCUELA ALLIPEN","FREIRE",6183,9105]
[6170,9105,"ESCUELA ARMANDO QUINTULEN","FREIRE",6170,9105]
[6181,9105,"ESCUELA COIPUE","FREIRE",6181,9105]
[6164,9105,"ESCUELA JUAN SEGUEL","FREIRE",6164,9105]
[6166,9105,"ESCUELA LA ESPERANZA","FREIRE",6166,9105]
[481,3303,"ESCUELA BASICA ALEJANDRO NOEMI HUERTA","FREIRINA",481,3303]
[484,3303,"ESCUELA DE MAITENCILLO","FREIRINA",484,3303]
[13181,3303,"ESCUELA EMILIA SCHWABE RUMOHR","FREIRINA",13181,3303]
[22105,10104,"ESCUELA BASICA FRESIA","FRESIA",22105,10104]
[7924,10104,"ESCUELA RURAL SAN ANDRES","FRESIA",7924,10104]
[7975,10105,"ESCUELA ARTURO ALESSANDRI PALMA","FRUTILLAR",7975,10105]
[7976,10105,"ESCUELA BERNARDO PHILIPPI","FRUTILLAR",7976,10105]
[11548,10105,"ESCUELA CLAUDIO MATTE","FRUTILLAR",11548,10105]
[7977,10105,"ESCUELA RURAL LOS LINARES DE CASMA","FRUTILLAR",7977,10105]
[22493,10105,"ESCUELA VICENTE PEREZ ROSALES","FRUTILLAR",22493,10105]
[8331,10402,"ESCUELA FUTALEUFU","FUTALEUFU",8331,10402]
[6983,14202,"ESCUELA BASICA JOSE M. BALMACEDA F.","FUTRONO",6983,14202]
[22240,14202,"ESCUELA DE PARVULOS LOS PUMITAS","FUTRONO",22240,14202]
[6986,14202,"ESCUELA FRONTERIZA DE LLIFEN","FUTRONO",6986,14202]
[7003,14202,"ESCUELA RURAL CURRINE","FUTRONO",7003,14202]
[6991,14202,"ESCUELA RURAL ISLA HUAPI","FUTRONO",6991,14202]
[6984,14202,"ESCUELA RURAL NONTUELA","FUTRONO",6984,14202]
[6732,9106,"ESC. BASICA FORTIN NIELOL","GALVARINO",6732,9106]
[6718,9106,"ESCUELA BASICA DE EL CAPRICHO","GALVARINO",6718,9106]
[6710,9106,"ESCUELA BASICA DE LA PIEDRA","GALVARINO",6710,9106]
[6711,9106,"ESCUELA BASICA MANIUCO","GALVARINO",6711,9106]
[6714,9106,"ESCUELA MUNICIPAL DE LLUQUENTUE","GALVARINO",6714,9106]
[20200,9106,"ESCUELA MUNICIPAL GABRIELA MISTRAL","GALVARINO",20200,9106]
[6709,9106,"ESCUELA MUNICIPAL RIO QUILLEN","GALVARINO",6709,9106]
[6712,9106,"ESCUELA SAN JUAN DE AILLINCO","GALVARINO",6712,9106]
[6273,9107,"ESC.PRESBITERO JOSE AGUSTIN GOMEZ Z.","GORBEA",6273,9107]
[6271,9107,"ESCUELA BASICA CINCO","GORBEA",6271,9107]
[6272,9107,"ESCUELA BASICA LICARAYEN","GORBEA",6272,9107]
[6285,9107,"ESCUELA BASICA LOS PERALES","GORBEA",6285,9107]
[6270,9107,"LICEO JOSE VICTORINO LASTARRIA","GORBEA",6270,9107]
[2209,6106,"COLEGIO ANTONIO TRDAN ARKO","GRANEROS",2209,6106]
[15762,6106,"COLEGIO MARÍA ESCOBILLANA GUZMÁN","GRANEROS",15762,6106]
[2212,6106,"ESCUELA MUNICIPAL DE TUNICHE","GRANEROS",2212,6106]
[2210,6106,"ESCUELA MUNICIPAL VILLA LA COMPANIA","GRANEROS",2210,6106]
[2206,6106,"ESCUELA SIXTO MENDEZ PARADA","GRANEROS",2206,6106]
[8392,11203,"LICEO MELINKA","GUAITECAS",8392,11203]
[1454,5503,"ESCUELA ADRIANA RIQUELME NUNEZ","HIJUELAS",1454,5503]
[1456,5503,"ESCUELA ANA JESUS IBACACHE","HIJUELAS",1456,5503]
[1457,5503,"ESCUELA BASICA BENJAMIN MATTE LARRAIN","HIJUELAS",1457,5503]
[1458,5503,"ESCUELA BASICA LA SOMBRA","HIJUELAS",1458,5503]
[1462,5503,"ESCUELA BASICA LOS TILOS DE HUALCAPO","HIJUELAS",1462,5503]
[1459,5503,"ESCUELA BASICA RABUCO","HIJUELAS",1459,5503]
[1455,5503,"ESCUELA MONICA HURTADO EDWARDS","HIJUELAS",1455,5503]
[1453,5503,"LICEO MUNICIPAL LUIS LABORDA","HIJUELAS",1453,5503]
[16428,7302,"ESC. MONSENOR MANUEL LARRAIN ERRAZURIZ","HUALAÑE",16428,7302]
[2894,7302,"ESCUELA AMELIA VIAL DE CONCHA","HUALAÑE",2894,7302]
[2883,7302,"ESCUELA LA HUERTA DE MATAQUITO","HUALAÑE",2883,7302]
[8310,10403,"COLEGIO MAURICIO HITCHCOCK","HUALAIHUE",8310,10403]
[8325,10403,"ESCUELA ANTUPIREN","HUALAIHUE",8325,10403]
[8313,10403,"ESCUELA RURAL CATARATAS DEL ALERCE","HUALAIHUE",8313,10403]
[8323,10403,"ESCUELA RURAL N.745 SEMILLERO","HUALAIHUE",8323,10403]
[4737,8112,"COLEGIO BASICO VILLA ACERO","HUALPEN",4737,8112]
[4730,8112,"ESCUELA ALONKURA","HUALPEN",4730,8112]
[4731,8112,"ESCUELA BÁSICA CRISTÓBAL COLÓN","HUALPEN",4731,8112]
[4722,8112,"ESCUELA BLANCA ESTELA PRAT CARVAJAL","HUALPEN",4722,8112]
[4714,8112,"ESCUELA HELEN KELLER ADAMS","HUALPEN",4714,8112]
[4719,8112,"ESCUELA REPUBLICA DEL PERU","HUALPEN",4719,8112]
[4713,8112,"ESCUELA THOMAS JEFFERSON D 465","HUALPEN",4713,8112]
[4717,8112,"LICEO TÉCNICO PROFESIONAL LUCILA GODOY ALCAYAGA","HUALPEN",4717,8112]
[4908,8105,"ESCUELA ALEJANDRO VARELA SANTA MARIA","HUALQUI",4908,8105]
[12058,8105,"ESCUELA BASICA LOS LIBERTADORES","HUALQUI",12058,8105]
[4902,8105,"ESCUELA CARLOS ALBERTO FERNÁNDEZ CASTILLO","HUALQUI",4902,8105]
[4898,8105,"ESCUELA MANUEL AMAT Y JUNIET","HUALQUI",4898,8105]
[18065,8105,"ESCUELA NUEVA REPUBLICA","HUALQUI",18065,8105]
[156,1404,"ESCUELA PISAGUA","HUARA",156,1404]
[161,1404,"LICEO DE HUARA","HUARA",161,1404]
[487,3304,"ESCUELA BASICA JOSE MIGUEL CARRERA","HUASCO",487,3304]
[489,3304,"ESCUELA EL OLIVAR","HUASCO",489,3304]
[13134,3304,"ESCUELA MIREYA ZULETA ASTUDILLO","HUASCO",13134,3304]
[10277,13107,"ESCUELA ADELAIDA LA FETRA","HUECHURABA",10277,13107]
[16879,13107,"ESCUELA BÁSICA N°2442 `CENTRO EDUCACIONAL ERNESTO YAÑEZ RIVERA`","HUECHURABA",16879,13107]
[10272,13107,"ESCUELA BASICA CARLOS PRATS G.","HUECHURABA",10272,13107]
[10290,13107,"ESCUELA LAS CANTERAS","HUECHURABA",10290,13107]
[10285,13107,"ESCUELA SANTA VICTORIA DE HUECHURABA","HUECHURABA",10285,13107]
[10305,13107,"ESCUELA SANTIAGO DE GUAYAQUIL","HUECHURABA",10305,13107]
[974,4201,"ESCUELA BASICA CAMILO HENRIQUEZ","ILLAPEL",974,4201]
[973,4201,"ESCUELA BASICA CLEMENCIA VILLARROEL","ILLAPEL",973,4201]
[977,4201,"ESCUELA BASICA GRACIELA DIAZ ALLENDE","ILLAPEL",977,4201]
[976,4201,"ESCUELA BASICA LAS PALMERAS DE LIMAHUIDA","ILLAPEL",976,4201]
[971,4201,"ESCUELA BASICA SAN RAFAEL DE ROZAS","ILLAPEL",971,4201]
[969,4201,"ESCUELA BASICA VALLE DEL CHOAPA","ILLAPEL",969,4201]
[982,4201,"ESCUELA BASICA VILLA LOS NARANJOS","ILLAPEL",982,4201]
[970,4201,"ESCUELA JUAN CARRASCO RISCO","ILLAPEL",970,4201]
[8529,13108,"ESCUELA DE PARVULOS ANTU-HUILEN","INDEPENDENCIA",8529,13108]
[10282,13108,"ESCUELA LUIS GALDAMES","INDEPENDENCIA",10282,13108]
[8547,13108,"ESCUELA NUEVA ZELANDIA","INDEPENDENCIA",8547,13108]
[10199,13108,"LICEO POLIVALENTE A80 PRESIDENTE JOSE MANUEL BALMACEDA","INDEPENDENCIA",10199,13108]
[8542,13108,"LICEO SAN FRANCISCO DE QUITO","INDEPENDENCIA",8542,13108]
[123,1101,"COLEGIO ESPANA","IQUIQUE",123,1101]
[116,1101,"COLEGIO REPUBLICA DE CROACIA","IQUIQUE",116,1101]
[126,1101,"COLEGIO REPUBLICA DE ITALIA","IQUIQUE",126,1101]
[102,1101,"ESC.EDUC.ESPECIAL FLOR DEL INCA","IQUIQUE",102,1101]
[113,1101,"ESCUELA ALMIRANTE PATRICIO LYNCH","IQUIQUE",113,1101]
[12542,1101,"ESCUELA CALETA SAN MARCOS","IQUIQUE",12542,1101]
[119,1101,"ESCUELA CENTENARIO","IQUIQUE",119,1101]
[12538,1101,"ESCUELA CHIPANA","IQUIQUE",12538,1101]
[112,1101,"ESCUELA EDUARDO LLANOS","IQUIQUE",112,1101]
[111,1101,"ESCUELA GABRIELA MISTRAL","IQUIQUE",111,1101]
[117,1101,"ESCUELA PAULA JARAQUEMADA ALQUIZAR","IQUIQUE",117,1101]
[114,1101,"ESCUELA PLACIDO VILLARROEL","IQUIQUE",114,1101]
[125,1101,"ESCUELA PROFESOR MANUEL CASTRO RAMOS","IQUIQUE",125,1101]
[122,1101,"ESCUELA THILDA PORTILLO OLIVARES","IQUIQUE",122,1101]
[110,1101,"LICEO BICENTENARIO DOMINGO SANTA MARIA DE IQQ.","IQUIQUE",110,1101]
[10726,13603,"CENTRO DE EDUCACION MARIO BERTERO CEVASCO","ISLA DE MAIPO",10726,13603]
[10730,13603,"ESC.BASICA SAN ANTONIO DE NALTAGUA","ISLA DE MAIPO",10730,13603]
[10729,13603,"ESCUELA BASICA EFRAIN MALDONADO TORRES","ISLA DE MAIPO",10729,13603]
[25189,13603,"ESCUELA BASICA FUTURO LAS MERCEDES","ISLA DE MAIPO",25189,13603]
[10727,13603,"LICEO REPUBLICA DE ITALIA","ISLA DE MAIPO",10727,13603]
[2101,5201,"COLEGIO BASICO LORENZO BAEZA VEGA","ISLA DE PASCUA",2101,5201]
[2009,5104,"COLEGIO INSULAR ROBINSON CRUSOE","JUAN FERNANDEZ",2009,5104]
[9730,13109,"COLEGIO ANTU","LA CISTERNA",9730,13109]
[9699,13109,"COLEGIO NACIONES UNIDAS","LA CISTERNA",9699,13109]
[9700,13109,"COLEGIO PALESTINO","LA CISTERNA",9700,13109]
[9706,13109,"ESCUELA BAS. OSCAR ENCALADA YOVANOVICH","LA CISTERNA",9706,13109]
[9703,13109,"ESCUELA ESPERANZA JOVEN","LA CISTERNA",9703,13109]
[9701,13109,"LICEO POLIVALENTE OLOF PALME","LA CISTERNA",9701,13109]
[1417,5504,"COLEGIO BOLONIA","LA CRUZ",1417,5504]
[1419,5504,"COLEGIO DOMINGO SANTA CRUZ WILSON","LA CRUZ",1419,5504]
[1414,5504,"COLEGIO LEONARDO DA VINCI","LA CRUZ",1414,5504]
[1416,5504,"COLEGIO MARIA ALONSO CHACON","LA CRUZ",1416,5504]
[1418,5504,"ESCUELA BASICA","LA CRUZ",1418,5504]
[2694,6202,"ESCUELA PROF. MONICA SILVA GOMEZ","LA ESTRELLA",2694,6202]
[16958,13110,"COLEGIO ARTISTICO SOL DEL ILLIMANI","LA FLORIDA",16958,13110]
[24401,13110,"COLEGIO CAPITAN PASTENE","LA FLORIDA",24401,13110]
[25041,13110,"COLEGIO MARIA ELENA","LA FLORIDA",25041,13110]
[24716,13110,"ESCUELA BASICA LOS NAVIOS","LA FLORIDA",24716,13110]
[9283,13110,"ESCUELA BELLAVISTA","LA FLORIDA",9283,13110]
[24649,13110,"ESCUELA DE PARVULOS SAMORITO","LA FLORIDA",24649,13110]
[9284,13110,"ESCUELA ELSA SANTIBANEZ","LA FLORIDA",9284,13110]
[9282,13110,"ESCUELA GUARDIAMARINA ERNESTO RIQUELME","LA FLORIDA",9282,13110]
[9289,13110,"ESCUELA LAS ARAUCARIAS","LA FLORIDA",9289,13110]
[9296,13110,"ESCUELA LAS LILAS","LA FLORIDA",9296,13110]
[9302,13110,"ESCUELA LO CANAS","LA FLORIDA",9302,13110]
[9304,13110,"ESCUELA LOS CEREZOS","LA FLORIDA",9304,13110]
[9285,13110,"ESCUELA MARCELA PAZ","LA FLORIDA",9285,13110]
[9307,13110,"ESCUELA OSCAR CASTRO","LA FLORIDA",9307,13110]
[9290,13110,"ESCUELA SOTERO DEL RIO","LA FLORIDA",9290,13110]
[31432,13110,"LICEO ALTO CORDILLERA DE LA FLORIDA","LA FLORIDA",31432,13110]
[9294,13110,"LICEO ANDRES BELLO","LA FLORIDA",9294,13110]
[9298,13110,"LICEO INDIRA GANDHI","LA FLORIDA",9298,13110]
[9288,13110,"LICEO NUEVO AMANECER","LA FLORIDA",9288,13110]
[9293,13110,"LICEO POLIVALENTE LOS ALMENDROS","LA FLORIDA",9293,13110]
[9605,13111,"COLEGIO MUNICIPAL PROCERES DE CHILE","LA GRANJA",9605,13111]
[9618,13111,"ESCUELA BAS. BENJAMIN SUBERCASEAUX","LA GRANJA",9618,13111]
[9606,13111,"ESCUELA BAS. LA ARAUCANIA","LA GRANJA",9606,13111]
[9443,13111,"ESCUELA BAS. LOS HEROES DE YUNGAY","LA GRANJA",9443,13111]
[9610,13111,"ESCUELA BAS. POETA OSCAR CASTRO ZUNIGA","LA GRANJA",9610,13111]
[9588,13111,"ESCUELA BAS. TECNO SUR","LA GRANJA",9588,13111]
[9612,13111,"ESCUELA BASICA ISLAS DE CHILE","LA GRANJA",9612,13111]
[9590,13111,"ESCUELA BELGICA","LA GRANJA",9590,13111]
[9607,13111,"ESCUELA DIFERENCIAL SANTA TERESITA DE LOS AND","LA GRANJA",9607,13111]
[9585,13111,"LICEO DOCTOR ALEJANDRO DEL RIO","LA GRANJA",9585,13111]
[9587,13111,"LICEO MALAQUIAS CONCHA","LA GRANJA",9587,13111]
[9617,13111,"LICEO MUNICIPAL LA GRANJA POETA NERUDA","LA GRANJA",9617,13111]
[602,4104,"ESCUELA BASICA CARLOS CONDELL","LA HIGUERA",602,4104]
[597,4104,"ESCUELA BASICA PEDRO PABLO MUNOZ","LA HIGUERA",597,4104]
[11199,5401,"COLEGIO LUIS CRUZ MARTINEZ","LA LIGUA",11199,5401]
[1128,5401,"ESCUELA COMUNIDADES DE VALLE HERMOSO","LA LIGUA",1128,5401]
[1125,5401,"ESCUELA DIEGO PORTALES","LA LIGUA",1125,5401]
[1123,5401,"ESCUELA GABRIELA MISTRAL","LA LIGUA",1123,5401]
[1139,5401,"ESCUELA MINISTRO GOMEZ MILLAS","LA LIGUA",1139,5401]
[1122,5401,"ESCUELA REPUBLICA DE VENEZUELA","LA LIGUA",1122,5401]
[9602,13112,"COLEGIO NERUDA","LA PINTANA",9602,13112]
[24403,13112,"COLEGIO SIMON BOLIVAR","LA PINTANA",24403,13112]
[9620,13112,"ESCUELA BASICA JUAN DE DIOS ALDEA","LA PINTANA",9620,13112]
[9595,13112,"ESCUELA CAPITAN AVALOS","LA PINTANA",9595,13112]
[9598,13112,"ESCUELA MUNICIPAL VIOLETA PARRA","LA PINTANA",9598,13112]
[9597,13112,"ESCUELA PABLO DE ROKHA","LA PINTANA",9597,13112]
[24445,13112,"LICEO MUNICIPAL EL ROBLE","LA PINTANA",24445,13112]
[9604,13112,"LICEO MUNICIPALIZADO CENT.ED. LA PINTANA","LA PINTANA",9604,13112]
[9591,13112,"LICEO N523","LA PINTANA",9591,13112]
[9616,13112,"LICEO VICTOR JARA","LA PINTANA",9616,13112]
[9008,13113,"COLEGIO MUNICIPALIZADO CONFEDERAC SUIZA","LA REINA",9008,13113]
[9011,13113,"COLEGIO SAN CONSTANTINO","LA REINA",9011,13113]
[9006,13113,"COMPLEJO EDUCACIONAL LA REINA","LA REINA",9006,13113]
[9010,13113,"ESCUELA D-231 ESPECIAL DE DESARROLLO","LA REINA",9010,13113]
[9013,13113,"ESCUELA PALESTINA","LA REINA",9013,13113]
[9007,13113,"LICEO EUGENIO MARÍA DE HOSTOS","LA REINA",9007,13113]
[543,4101,"COLEGIO ALTOVALSOL","LA SERENA",543,4101]
[519,4101,"COLEGIO ARTURO PRAT CHACON","LA SERENA",519,4101]
[536,4101,"COLEGIO BERNARDA MORIN","LA SERENA",536,4101]
[562,4101,"COLEGIO CALETA SAN PEDRO","LA SERENA",562,4101]
[13463,4101,"COLEGIO CARLOS CONDELL DE LA HAZA","LA SERENA",13463,4101]
[546,4101,"COLEGIO COQUIMBITO","LA SERENA",546,4101]
[539,4101,"COLEGIO DE ALGARROBITO","LA SERENA",539,4101]
[530,4101,"COLEGIO GABRIEL GONZALEZ VIDELA","LA SERENA",530,4101]
[527,4101,"COLEGIO HEROES DE LA CONCEPCION","LA SERENA",527,4101]
[525,4101,"COLEGIO JAPON","LA SERENA",525,4101]
[522,4101,"COLEGIO JAVIERA CARRERA","LA SERENA",522,4101]
[526,4101,"COLEGIO JOSE MANUEL BALMACEDA","LA SERENA",526,4101]
[535,4101,"COLEGIO JOSE MIGUEL CARRERA","LA SERENA",535,4101]
[537,4101,"COLEGIO LUIS BRAILLE","LA SERENA",537,4101]
[529,4101,"COLEGIO MANUEL RODRIGUEZ","LA SERENA",529,4101]
[531,4101,"COLEGIO PEDRO AGUIRRE CERDA","LA SERENA",531,4101]
[560,4101,"COLEGIO QUEBRADA DE TALCA","LA SERENA",560,4101]
[521,4101,"COLEGIO VICTOR DOMINGO SILVA","LA SERENA",521,4101]
[534,4101,"COLEGIO VILLA SAN BARTOLOME","LA SERENA",534,4101]
[523,4101,"ESCUELA ALONSO DE ERCILLA","LA SERENA",523,4101]
[548,4101,"ESCUELA DE COLONIA ALFALFARES","LA SERENA",548,4101]
[544,4101,"ESCUELA DE EL MILAGRO","LA SERENA",544,4101]
[540,4101,"ESCUELA DE ISLON","LA SERENA",540,4101]
[542,4101,"ESCUELA DE LAMBERT","LA SERENA",542,4101]
[551,4101,"ESCUELA DE LAS ROJAS","LA SERENA",551,4101]
[556,4101,"ESCUELA DE ROMERO","LA SERENA",556,4101]
[557,4101,"ESCUELA DE SATURNO","LA SERENA",557,4101]
[528,4101,"ESCUELA GERMAN RIESCO","LA SERENA",528,4101]
[7128,14201,"COLEGIO DE CULTURA Y DIFUSION ARTISTICA","LA UNION",7128,14201]
[7132,14201,"ESC.DIFERENC.VILLA SAN JOSE DE LA UNION","LA UNION",7132,14201]
[22354,14201,"ESCUELA EL MAITEN","LA UNION",22354,14201]
[20439,14201,"ESCUELA ESPECIAL DE LENGUAJE MUNICIPAL","LA UNION",20439,14201]
[7130,14201,"ESCUELA LA UNION","LA UNION",7130,14201]
[7131,14201,"ESCUELA PRESIDENTE JORGE ALESSANDRI R.","LA UNION",7131,14201]
[7133,14201,"ESCUELA RADIMADI","LA UNION",7133,14201]
[7166,14201,"ESCUELA RURAL ALDEA CAMPESINA","LA UNION",7166,14201]
[7136,14201,"ESCUELA RURAL CATAMUTUN","LA UNION",7136,14201]
[7137,14201,"ESCUELA RURAL CHOROICO","LA UNION",7137,14201]
[7142,14201,"ESCUELA RURAL CUINCO","LA UNION",7142,14201]
[7140,14201,"ESCUELA RURAL LOS ESTEROS","LA UNION",7140,14201]
[7170,14201,"ESCUELA RURAL MASHUE","LA UNION",7170,14201]
[7138,14201,"ESCUELA RURAL PUERTO NUEVO","LA UNION",7138,14201]
[7157,14201,"ESCUELA RURAL TRAIGUEN","LA UNION",7157,14201]
[22758,14203,"COMPLEJO EDUCACIONAL IGNAO","LAGO RANCO",22758,14203]
[7303,14203,"ESCUELA RURAL RININAHUE","LAGO RANCO",7303,14203]
[7299,14203,"LICEO ANTONIO VARAS","LAGO RANCO",7299,14203]
[17704,8304,"ESCUELA AMANDA LABARCA","LAJA",17704,8304]
[11677,8304,"ESCUELA ANDRES ALCAZAR","LAJA",11677,8304]
[4484,8304,"ESCUELA BASICA LA COLONIA","LAJA",4484,8304]
[4485,8304,"ESCUELA FRANCISCO PEDRO ZATTERA GUELFI","LAJA",4485,8304]
[4481,8304,"ESCUELA JOSE ABELARDO NUNEZ","LAJA",4481,8304]
[4486,8304,"ESCUELA LAS CIÉNAGAS","LAJA",4486,8304]
[4482,8304,"ESCUELA NIVEQUETEN","LAJA",4482,8304]
[4254,8304,"ESCUELA PUENTE PERALES","LAJA",4254,8304]
[10422,13302,"ESCUELA BASICA CACIQUE COLIN","LAMPA",10422,13302]
[10427,13302,"ESCUELA BASICA F - N°372 SANTA SARA","LAMPA",10427,13302]
[10426,13302,"ESCUELA BASICA F-N°371 SANTA ROSA DE LAMPA","LAMPA",10426,13302]
[10428,13302,"ESCUELA BASICA G-N°373 EL LUCERO","LAMPA",10428,13302]
[10420,13302,"ESCUELA MANUEL SEGOVIA MONTENEGRO","LAMPA",10420,13302]
[10425,13302,"ESCUELA POLONIA GUTIERREZ C.","LAMPA",10425,13302]
[10421,13302,"ESCUELA REPUBLICA DE POLONIA","LAMPA",10421,13302]
[10424,13302,"ESCUELA SANTA BARBARA","LAMPA",10424,13302]
[10429,13302,"NORMA GONZÁLEZ GUERRA","LAMPA",10429,13302]
[6916,14103,"ESCUELA ALBERTO CORDOVA LATORRE","LANCO",6916,14103]
[6898,14103,"ESCUELA FELIPE BARTHOU CORBEAUX","LANCO",6898,14103]
[6899,14103,"LICEO REPUBLICA DEL BRASIL","LANCO",6899,14103]
[2429,6107,"COLEGIO INES DE SUAREZ","LAS CABRAS",2429,6107]
[2426,6107,"ESC. CONTRAMAESTRE CONSTANTINO MICALVI","LAS CABRAS",2426,6107]
[2423,6107,"ESCUELA BASICA ROMILIO ARELLANO TRONCOSO","LAS CABRAS",2423,6107]
[2425,6107,"ESCUELA MUNICIPAL DE LOS AROMOS","LAS CABRAS",2425,6107]
[2427,6107,"ESCUELA MUNICIPAL MAESTRO JORGE LOPEZ OSORIO","LAS CABRAS",2427,6107]
[2432,6107,"ESCUELA MUNICIPAL VILMA ALIAGA CALDERON","LAS CABRAS",2432,6107]
[2428,6107,"ESCUELA REPUBLICA DE GRECIA","LAS CABRAS",2428,6107]
[24721,13114,"COLEGIO LEONARDO DA VINCI DE LAS CONDES","LAS CONDES",24721,13114]
[8815,13114,"COLEGIO SAN FRANCISCO DEL ALBA","LAS CONDES",8815,13114]
[8822,13114,"LICEO JUAN PABLO II DE LAS CONDES","LAS CONDES",8822,13114]
[8835,13114,"LICEO SANTA MARIA DE LAS CONDES","LAS CONDES",8835,13114]
[8828,13114,"LICEO SIMON BOLIVAR","LAS CONDES",8828,13114]
[5825,9108,"ESC. BASICA AMELIA GODOY","LAUTARO",5825,9108]
[5828,9108,"ESC. BASICA GUACOLDA","LAUTARO",5828,9108]
[5824,9108,"ESC. BASICA NUMERO SEIS","LAUTARO",5824,9108]
[5854,9108,"ESC. BASICA VEGA LARGA","LAUTARO",5854,9108]
[5837,9108,"ESCUELA DOLLICO ALTO","LAUTARO",5837,9108]
[5827,9108,"ESCUELA IRENE FREI","LAUTARO",5827,9108]
[5829,9108,"ESCUELA LOS CACHORROS","LAUTARO",5829,9108]
[6604,9108,"ESCUELA LOS CARRERA","LAUTARO",6604,9108]
[5831,9108,"LICEO LOS CASTANOS","LAUTARO",5831,9108]
[5033,8201,"ESCUELA ARTURO EBENSPERGER RICHTER","LEBU",5033,8201]
[5028,8201,"ESCUELA BOCA LEBU","LEBU",5028,8201]
[5031,8201,"ESCUELA DR.ARNOLDO EBENSPERGER RICHTER","LEBU",5031,8201]
[5022,8201,"ESCUELA ESPECIAL JUAN SANDOVAL CARRASCO","LEBU",5022,8201]
[5026,8201,"ESCUELA FRESIA GRACIELA MULLER RUIZ","LEBU",5026,8201]
[5039,8201,"ESCUELA GUILLERMO RODRIGUEZ RIOBIO","LEBU",5039,8201]
[5034,8201,"ESCUELA LA FORTUNA","LEBU",5034,8201]
[5038,8201,"ESCUELA PEHUEN","LEBU",5038,8201]
[5025,8201,"ESCUELA PROFESORA REBECA CASTRO ARANEDA","LEBU",5025,8201]
[2903,7303,"COLEGIO DR. MANUEL AVILES INOSTROZA","LICANTEN",2903,7303]
[2908,7303,"ESCUELA ALEJANDRO ROJAS SIERRA","LICANTEN",2908,7303]
[2901,7303,"ESCUELA LOS COPIHUES","LICANTEN",2901,7303]
[2896,7303,"LICEO AUGUSTO SANTELICES VALENZUELA","LICANTEN",2896,7303]
[1468,5802,"ESCUELA BASICA BRASILIA","LIMACHE",1468,5802]
[1469,5802,"ESCUELA BASICA HEROES DE CHILE","LIMACHE",1469,5802]
[1472,5802,"ESCUELA BASICA LOS MAITENES","LIMACHE",1472,5802]
[1465,5802,"ESCUELA COEDUC TTE HERNAN MERINO CORREA","LIMACHE",1465,5802]
[1471,5802,"ESCUELA LIMACHITO","LIMACHE",1471,5802]
[1466,5802,"ESCUELA SUPERIOR MIXTA N║ 88","LIMACHE",1466,5802]
[3257,7401,"ESCUELA ALEJANDRO GIDI","LINARES",3257,7401]
[3258,7401,"ESCUELA BASICA ESPANA","LINARES",3258,7401]
[3244,7401,"ESCUELA ESPECIAL LAS VIOLETAS","LINARES",3244,7401]
[3267,7401,"ESCUELA GRACIELA LETELIER","LINARES",3267,7401]
[3269,7401,"ESCUELA LAS HORNILLAS","LINARES",3269,7401]
[3265,7401,"ESCUELA LAS TOSCAS","LINARES",3265,7401]
[3285,7401,"ESCUELA LLANKANAO MANUEL FRANCISCO MEZA SECO","LINARES",3285,7401]
[3260,7401,"ESCUELA LOS LEONES","LINARES",3260,7401]
[3263,7401,"ESCUELA MAITENES","LINARES",3263,7401]
[3273,7401,"ESCUELA MATIAS COUSINO","LINARES",3273,7401]
[3250,7401,"ESCUELA PRESIDENTE CARLOS IBANEZ DEL C.","LINARES",3250,7401]
[3256,7401,"ESCUELA RAMON BELMAR SALDIAS","LINARES",3256,7401]
[3251,7401,"ESCUELA REPUBLICA DE FRANCIA","LINARES",3251,7401]
[3268,7401,"ESCUELA SALOMON SALMAN DABUD","LINARES",3268,7401]
[3266,7401,"ESCUELA SAN ANTONIO","LINARES",3266,7401]
[3264,7401,"ESCUELA SAN VICTOR ALAMOS","LINARES",3264,7401]
[3255,7401,"ESCUELA SANTA BARBARA","LINARES",3255,7401]
[3249,7401,"ESCUELA UNO ISABEL RIQUELME","LINARES",3249,7401]
[3270,7401,"JANUARIO ESPINOSA","LINARES",3270,7401]
[3253,7401,"JUAN MARTINEZ DE ROZAS","LINARES",3253,7401]
[3261,7401,"PEDRO AGUIRRE CERDA","LINARES",3261,7401]
[40078,6203,"ESCUELA CARDENAL RAUL SILVA HENRIQUEZ","LITUECHE",40078,6203]
[2686,6203,"ESCUELA MUNICIPAL PULIN","LITUECHE",2686,6203]
[2682,6203,"ESCUELA MUNICIPAL QUELENTARO","LITUECHE",2682,6203]
[1336,5703,"ESCUELA AGUSTIN EDWARDS","LLAILLAY",1336,5703]
[1341,5703,"ESCUELA BASICA EL PORVENIR","LLAILLAY",1341,5703]
[1339,5703,"ESCUELA ELISA LATTAPIAT VARGAS","LLAILLAY",1339,5703]
[1340,5703,"ESCUELA HERMINIA ORTEGA DE CROXATO","LLAILLAY",1340,5703]
[1337,5703,"ESCUELA HEROES DE IQUIQUE","LLAILLAY",1337,5703]
[1346,5703,"ESCUELA JORGE PRIETO LETELIER","LLAILLAY",1346,5703]
[1342,5703,"ESCUELA LAS PALMAS","LLAILLAY",1342,5703]
[1343,5703,"ESCUELA LAS PENAS","LLAILLAY",1343,5703]
[1345,5703,"ESCUELA LAS VEGAS","LLAILLAY",1345,5703]
[1338,5703,"ESCUELA NACIONES UNIDAS","LLAILLAY",1338,5703]
[7959,10107,"ESCUELA BASICA GABRIELA MISTRAL","LLANQUIHUE",7959,10107]
[7958,10107,"ESCUELA INES GALLARDO ALVARADO","LLANQUIHUE",7958,10107]
[7967,10107,"ESCUELA RURAL COLEGUAL","LLANQUIHUE",7967,10107]
[7961,10107,"ESCUELA RURAL LOS PELLINES","LLANQUIHUE",7961,10107]
[8837,13115,"ESCUELA DE ED.DIFERENCIAL LO BARNECHEA","LO BARNECHEA",8837,13115]
[8840,13115,"ESCUELA DE FARELLONES","LO BARNECHEA",8840,13115]
[26037,13115,"INSTITUTO ESTADOS AMERICANOS LO BARNECHEA","LO BARNECHEA",26037,13115]
[9720,13116,"COLEGIO HERNAN OLGUIN","LO ESPEJO",9720,13116]
[9719,13116,"ESCUELA BASICA","LO ESPEJO",9719,13116]
[9716,13116,"ESCUELA BASICA ACAPULCO","LO ESPEJO",9716,13116]
[9736,13116,"ESCUELA BASICA BERNARDO O┤HIGGINS","LO ESPEJO",9736,13116]
[9733,13116,"ESCUELA BASICA CLARA ESTRELLA","LO ESPEJO",9733,13116]
[9741,13116,"ESCUELA BASICA COEDUCACIONAL","LO ESPEJO",9741,13116]
[9740,13116,"ESCUELA BASICA REPUBLICA DE LAS FILIPINAS","LO ESPEJO",9740,13116]
[9705,13116,"ESCUELA BASICA SALOMON SACK","LO ESPEJO",9705,13116]
[9710,13116,"ESCUELA BASICA SANTA ADRIANA","LO ESPEJO",9710,13116]
[9709,13116,"ESCUELA BLUE STAR COLLEGE","LO ESPEJO",9709,13116]
[9734,13116,"ESCUELA RAUL SAEZ SAEZ","LO ESPEJO",9734,13116]
[9697,13116,"LICEO POLIVALENTE","LO ESPEJO",9697,13116]
[9726,13116,"LICEO TENIENTE FRANCISCO MERY AGUIRRE","LO ESPEJO",9726,13116]
[10076,13117,"COMPLEJO EDUCACIONAL PEDRO PRADO","LO PRADO",10076,13117]
[10127,13117,"ESC.DE EDUCACION DIFERENCIAL QUILLAHUE","LO PRADO",10127,13117]
[10114,13117,"ESCUELA BASICA N°389 REPUBLICA DE ESTADOS UNIDOS","LO PRADO",10114,13117]
[10092,13117,"ESCUELA GOLDA MEIR","LO PRADO",10092,13117]
[10095,13117,"ESCUELA IGNACIO CARRERA PINTO","LO PRADO",10095,13117]
[10089,13117,"ESCUELA JAIME GOMEZ GARCIA","LO PRADO",10089,13117]
[10097,13117,"ESCUELA MARISCAL DE AYACUCHO","LO PRADO",10097,13117]
[10106,13117,"ESCUELA POETA PABLO NERUDA","LO PRADO",10106,13117]
[10119,13117,"ESCUELA POETA VICENTE HUIDOBRO","LO PRADO",10119,13117]
[10091,13117,"ESCUELA PROFESORA GLADYS VALENZUELA V","LO PRADO",10091,13117]
[10103,13117,"ESCUELA SOR TERESA DE LOS ANDES","LO PRADO",10103,13117]
[10010,13117,"MUSTAFA KEMAL ATATURK","LO PRADO",10010,13117]
[15570,6304,"ESCUELA BASICA GALVARINO VALENZUELA MORAGA","LOLOL",15570,6304]
[2584,6304,"ESCUELA OCTAVIO MUJICA VALENZUELA","LOLOL",2584,6304]
[6304,9109,"ESCUELA ALBORADA","LONCOCHE",6304,9109]
[11472,9109,"ESCUELA ARAUCARIAS","LONCOCHE",11472,9109]
[6305,9109,"ESCUELA DOMITILA PINNA PARRA","LONCOCHE",6305,9109]
[6303,9109,"ESCUELA EGON ERNTS KEUTMANN BESGEN","LONCOCHE",6303,9109]
[3381,7403,"ESCUELA ANGEL CRUCHAGA SANTA MARIA","LONGAVI",3381,7403]
[3352,7403,"ESCUELA ANSELMO DEL CARMEN TAPIA LOYOLA","LONGAVI",3352,7403]
[3356,7403,"ESCUELA CARDENAL JOSE MARIA CARO","LONGAVI",3356,7403]
[3366,7403,"ESCUELA CARLOS MONTERO JARAMILLO","LONGAVI",3366,7403]
[16455,7403,"ESCUELA DE PARVULOS SEMILLITA","LONGAVI",16455,7403]
[3373,7403,"ESCUELA EL CARMEN","LONGAVI",3373,7403]
[3361,7403,"ESCUELA FRANCISCO URRUTIA URRUTIA","LONGAVI",3361,7403]
[3362,7403,"ESCUELA GABRIEL BENAVENTE BENAVENTE","LONGAVI",3362,7403]
[3355,7403,"ESCUELA GABRIELA MISTRAL","LONGAVI",3355,7403]
[3358,7403,"ESCUELA JOSE MIGUEL CARRERA","LONGAVI",3358,7403]
[3368,7403,"ESCUELA JUAN SEGUNDO MUNOZ BRIONES","LONGAVI",3368,7403]
[3364,7403,"ESCUELA LUIS PEREIRA INIGUEZ","LONGAVI",3364,7403]
[3376,7403,"ESCUELA MARCELA PAZ","LONGAVI",3376,7403]
[3365,7403,"ESCUELA MARIA AMBROSIA TAPIA MENDEZ","LONGAVI",3365,7403]
[3354,7403,"ESCUELA ONOFRE VASQUEZ NORAMBUENA","LONGAVI",3354,7403]
[3371,7403,"ESCUELA PAULA JARAQUEMADA","LONGAVI",3371,7403]
[3382,7403,"ESCUELA PEDRO ALESSANDRI VARGAS","LONGAVI",3382,7403]
[3353,7403,"ESCUELA ROBERTO OPAZO GALVEZ","LONGAVI",3353,7403]
[3359,7403,"LICEO LAURA URRUTIA BENAVENTE","LONGAVI",3359,7403]
[5622,9205,"ESCUELA BÁSICA BERNARDO ÑANKO","LONQUIMAY",5622,9205]
[5326,9205,"ESCUELA BASICA MALALMAHUIDA","LONQUIMAY",5326,9205]
[5333,9205,"ESCUELA DE ICALMA","LONQUIMAY",5333,9205]
[5327,9205,"ESCUELA DE LIUCURA","LONQUIMAY",5327,9205]
[5339,9205,"ESCUELA DE TROYO","LONQUIMAY",5339,9205]
[5324,9205,"ESCUELA MUNICIPAL FRONTERIZA","LONQUIMAY",5324,9205]
[5109,8206,"ESCUELA CLAUDIO FLORES SOTO","LOS ALAMOS",5109,8206]
[5106,8206,"ESCUELA FELIX EYHERAMENDY","LOS ALAMOS",5106,8206]
[5121,8206,"ESCUELA JOSE ULLOA FIERRO","LOS ALAMOS",5121,8206]
[5119,8206,"ESCUELA LAS DUNAS","LOS ALAMOS",5119,8206]
[5113,8206,"ESCUELA ORLANDO DELGADO ZUNIGA","LOS ALAMOS",5113,8206]
[5110,8206,"ESCUELA PILPILCO","LOS ALAMOS",5110,8206]
[5112,8206,"ESCUELA ZAIDA ARANEDA VIGUERAS","LOS ALAMOS",5112,8206]
[1204,5301,"ESCUELA BASICA GRAL.JOSE MIGUEL CARRERA","LOS ANDES",1204,5301]
[1208,5301,"ESCUELA BASICA RIO BLANCO","LOS ANDES",1208,5301]
[1210,5301,"ESCUELA EL SAUCE","LOS ANDES",1210,5301]
[1197,5301,"ESCUELA ESPANA","LOS ANDES",1197,5301]
[1201,5301,"ESCUELA ESPECIAL VALLE ANDINO","LOS ANDES",1201,5301]
[1202,5301,"ESCUELA FERROVIARIA","LOS ANDES",1202,5301]
[1203,5301,"ESCUELA GABRIELA MISTRAL","LOS ANDES",1203,5301]
[1211,5301,"ESCUELA IGNACIO CARRERA PINTO","LOS ANDES",1211,5301]
[1200,5301,"ESCUELA JOHN KENNEDY","LOS ANDES",1200,5301]
[1198,5301,"LICEO REPUBLICA ARGENTINA","LOS ANDES",1198,5301]
[4180,8301,"ESCUELA ARTURO ALESSANDRI PALMA","LOS ANGELES",4180,8301]
[4187,8301,"ESCUELA BÁSICA ESPERANZA","LOS ANGELES",4187,8301]
[4201,8301,"ESCUELA BÁSICA HITILHUE","LOS ANGELES",4201,8301]
[4207,8301,"ESCUELA BÁSICA LA RINCONADA DEL SALTO","LOS ANGELES",4207,8301]
[4189,8301,"ESCUELA BASICA 11 DE SEPTIEMBRE","LOS ANGELES",4189,8301]
[4183,8301,"ESCUELA BASICA 21 DE MAYO","LOS ANGELES",4183,8301]
[12022,8301,"ESCUELA BASICA CHACAYAL SUR","LOS ANGELES",12022,8301]
[4235,8301,"ESCUELA BASICA EL AMANECER DE DUQUECO","LOS ANGELES",4235,8301]
[4255,8301,"ESCUELA BASICA EL NOGAL.","LOS ANGELES",4255,8301]
[4199,8301,"ESCUELA BASICA LA AGUADA DE CUEL","LOS ANGELES",4199,8301]
[4221,8301,"ESCUELA BASICA LA CAPILLA","LOS ANGELES",4221,8301]
[4231,8301,"ESCUELA BASICA LA LEYENDA","LOS ANGELES",4231,8301]
[4194,8301,"ESCUELA BASICA LA QUEBRADA","LOS ANGELES",4194,8301]
[4212,8301,"ESCUELA BASICA LAS QUINTAS","LOS ANGELES",4212,8301]
[4204,8301,"ESCUELA BASICA MILLANTU","LOS ANGELES",4204,8301]
[4186,8301,"ESCUELA BASICA REPUBLICA DE ALEMANIA","LOS ANGELES",4186,8301]
[4181,8301,"ESCUELA BASICA REPUBLICA DE ISRAEL","LOS ANGELES",4181,8301]
[4191,8301,"ESCUELA BASICA SANTA CLARA DE CHACAYAL","LOS ANGELES",4191,8301]
[4200,8301,"ESCUELA BASICA VIRQUENCO","LOS ANGELES",4200,8301]
[4173,8301,"ESCUELA BLANCO ENCALADA","LOS ANGELES",4173,8301]
[4177,8301,"ESCUELA CLARA REBOLLEDO DE GODOY","LOS ANGELES",4177,8301]
[4171,8301,"ESCUELA COLONIA ARABE","LOS ANGELES",4171,8301]
[4197,8301,"ESCUELA CORONEL GUILLERMO MARIN CARMONA","LOS ANGELES",4197,8301]
[4205,8301,"ESCUELA DIEGO PORTALES PALAZUELOS","LOS ANGELES",4205,8301]
[4168,8301,"ESCUELA GENERAL BERNARDO O HIGGINS","LOS ANGELES",4168,8301]
[4172,8301,"ESCUELA GENERAL JOSE DE SAN MARTIN","LOS ANGELES",4172,8301]
[4174,8301,"ESCUELA HOGAR NIEVES VASQUEZ PALACIOS","LOS ANGELES",4174,8301]
[4185,8301,"ESCUELA ISLA DE LAJA","LOS ANGELES",4185,8301]
[4179,8301,"ESCUELA PEDRO RUIZ ALDEA","LOS ANGELES",4179,8301]
[4188,8301,"ESCUELA REPUBLICA DE GRECIA","LOS ANGELES",4188,8301]
[4241,8301,"ESCUELA TENIENTE IGNACIO SERRANO","LOS ANGELES",4241,8301]
[4175,8301,"ESCUELA THOMAS JEFFERSON","LOS ANGELES",4175,8301]
[4195,8301,"LICEO AGROINDUSTRIAL LLANO BLANCO","LOS ANGELES",4195,8301]
[4190,8301,"LICEO SANTA FE","LOS ANGELES",4190,8301]
[6930,14104,"ESCUELA FRANCIA","LOS LAGOS",6930,14104]
[6932,14104,"ESCUELA NEVADA","LOS LAGOS",6932,14104]
[22558,14104,"ESCUELA NUEVA COLLILELFU","LOS LAGOS",22558,14104]
[6934,14104,"ESCUELA NUEVA ESPANA","LOS LAGOS",6934,14104]
[6935,14104,"ESCUELA RURAL ANTILHUE","LOS LAGOS",6935,14104]
[6953,14104,"ESCUELA RURAL EL SALTO","LOS LAGOS",6953,14104]
[6933,14104,"ESCUELA RURAL FOLILCO","LOS LAGOS",6933,14104]
[7872,10106,"COLEGIO DE DIFUSION ARTISTICA LOS ULMOS","LOS MUERMOS",7872,10106]
[22309,10106,"COLEGIO INGLÉS MABEL CONDEMARÍN","LOS MUERMOS",22309,10106]
[7874,10106,"ESCUELA RURAL CAÑITAS","LOS MUERMOS",7874,10106]
[7898,10106,"ESCUELA RURAL EL MELI","LOS MUERMOS",7898,10106]
[7896,10106,"ESCUELA RURAL ESTAQUILLA","LOS MUERMOS",7896,10106]
[7905,10106,"ESCUELA RURAL PARAGUAY CHICO","LOS MUERMOS",7905,10106]
[5550,9206,"ESCUELA BASICA VILLA TRINTE","LOS SAUCES",5550,9206]
[5538,9206,"ESCUELA GUSTAVO VASQUEZ DIAZ","LOS SAUCES",5538,9206]
[1049,4203,"COLEGIO DIEGO DE ALMAGRO","LOS VILOS",1049,4203]
[1050,4203,"ESCUELA BASICA ERCOLE BENCINI","LOS VILOS",1050,4203]
[1052,4203,"ESCUELA BASICA PABLO BARRIOLHET","LOS VILOS",1052,4203]
[1051,4203,"ESCUELA BASICA TERESA CANNON DE B.","LOS VILOS",1051,4203]
[1059,4203,"ESCUELA CLARA VIAL ORREGO","LOS VILOS",1059,4203]
[4960,8106,"COLEGIO ANGEL DE PEREDO","LOTA",4960,8106]
[4968,8106,"ESCUELA BÁSICA CARABINERO ISAÍAS GUEVARA","LOTA",4968,8106]
[4952,8106,"ESCUELA BALDOMERO LILLO FIGUEROA","LOTA",4952,8106]
[4956,8106,"ESCUELA BASICA BELLO HORIZONTE","LOTA",4956,8106]
[4967,8106,"ESCUELA BASICA CENTENARIO","LOTA",4967,8106]
[4961,8106,"ESCUELA BASICA COLCURA","LOTA",4961,8106]
[4955,8106,"ESCUELA BASICA KONRAD ADENAUER","LOTA",4955,8106]
[4954,8106,"ESCUELA BASICA SANTA MARIA DE GUADALUPE","LOTA",4954,8106]
[4958,8106,"ESCUELA BASICA THOMPSON MATTHEWS","LOTA",4958,8106]
[4953,8106,"ESCUELA ISIDORA GOYENECHEA","LOTA",4953,8106]
[5470,9207,"ESCUELA BASICA REPUBLICA DE ITALIA","LUMACO",5470,9207]
[5471,9207,"ESCUELA F-174 VALLE DE LUMACO","LUMACO",5471,9207]
[2251,6108,"COLEGIO BELLAVISTA","MACHALI",2251,6108]
[2247,6108,"COLEGIO GABRIELA MISTRAL","MACHALI",2247,6108]
[2246,6108,"COLEGIO JUAN TACHOIRE MOENA","MACHALI",2246,6108]
[2249,6108,"COLEGIO LOS LLANOS","MACHALI",2249,6108]
[2255,6108,"ESC. SAN JUAQUIN DE LOS MAYOS","MACHALI",2255,6108]
[2257,6108,"ESCUELA CHACAYES","MACHALI",2257,6108]
[2248,6108,"PARVULARIO GRAL. O. BONILLA","MACHALI",2248,6108]
[9090,13118,"ESCUELA BAS. CENTRO EDUCACIONAL MILLANTU","MACUL",9090,13118]
[9125,13118,"ESCUELA BASICA","MACUL",9125,13118]
[9085,13118,"ESCUELA JOSE BERNARDO SUAREZ","MACUL",9085,13118]
[9122,13118,"ESCUELA JULIO MONTT SALAMANCA","MACUL",9122,13118]
[9104,13118,"ESCUELA VILLA MACUL","MACUL",9104,13118]
[7032,14105,"ESCUELA ALABAMA","MAFIL",7032,14105]
[7031,14105,"LICEO GABRIELA MISTRAL","MAFIL",7031,14105]
[12255,13119,"COLEGIO ALCAZAR","MAIPU",12255,13119]
[25186,13119,"COLEGIO MUNIC. SAN SEBASTIAN DE RINCONADA","MAIPU",25186,13119]
[25314,13119,"ESCUELA BÁSICA 1737 LOS ALERCES DE MAIP┌","MAIPU",25314,13119]
[24883,13119,"ESCUELA BÁSICA MUNICIPAL SAN LUIS","MAIPU",24883,13119]
[9883,13119,"ESCUELA BÁSICA N 263 RAMON FREIRE","MAIPU",9883,13119]
[9895,13119,"ESCUELA BASICA REINA DE SUECIA","MAIPU",9895,13119]
[9893,13119,"ESCUELA ESPECIAL ANDALUE","MAIPU",9893,13119]
[9877,13119,"ESCUELA GENERAL OHIGGINS","MAIPU",9877,13119]
[9876,13119,"ESCUELA GENERAL SAN MARTIN","MAIPU",9876,13119]
[9892,13119,"ESCUELA LAS AMERICAS","MAIPU",9892,13119]
[9884,13119,"ESCUELA LEON HUMBERTO VALENZUELA","MAIPU",9884,13119]
[9878,13119,"ESCUELA PRESIDENTE RIESCO ERRAZURIZ","MAIPU",9878,13119]
[9890,13119,"ESCUELA TOMAS VARGAS","MAIPU",9890,13119]
[9881,13119,"ESCUELA VICENTE REYES PALAZUELOS","MAIPU",9881,13119]
[9864,13119,"LICEO JOSE IGNACIO ZENTENO","MAIPU",9864,13119]
[9889,13119,"LICEO REINO DE DINAMARCA","MAIPU",9889,13119]
[9863,13119,"LICEO SANTIAGO BUERAS Y AVARIA","MAIPU",9863,13119]
[9891,13119,"REPUBLICA DE GUATEMALA","MAIPU",9891,13119]
[2310,6109,"ESC.ALCIDES REYES FRIAS","MALLOA",2310,6109]
[2314,6109,"ESCUELA MUNICIPAL DE CORCOLEN","MALLOA",2314,6109]
[2313,6109,"ESCUELA MUNICIPAL DE LIMAHUE","MALLOA",2313,6109]
[2312,6109,"ESCUELA MUNICIPAL DE PANQUEHUE","MALLOA",2312,6109]
[2311,6109,"ESCUELA PELEQUEN","MALLOA",2311,6109]
[15526,6204,"ESCUELA MUNICIPAL AMERICA","MARCHIHUE",15526,6204]
[2708,6204,"ESCUELA MUNICIPAL PAILIMO","MARCHIHUE",2708,6204]
[210,2302,"ESCUELA ARTURO PEREZ CANTO","MARIA ELENA",210,2302]
[10836,13504,"ESCUELA BASICA F-N° 732 CHOROMBO ALTO","MARIA PINTO",10836,13504]
[10837,13504,"ESCUELA BASICA F-N°738 LOS RULOS","MARIA PINTO",10837,13504]
[10838,13504,"ESCUELA BASICA G-N°733 CHOROMBO BAJO","MARIA PINTO",10838,13504]
[10839,13504,"ESCUELA BASICA G-N°734 LAS MERCEDES","MARIA PINTO",10839,13504]
[10840,13504,"ESCUELA BASICA G-N°737 SANTA EMILIA","MARIA PINTO",10840,13504]
[10835,13504,"LICEO MUNICIPAL F-N°860","MARIA PINTO",10835,13504]
[22476,14106,"COLEGIO SAN JOSE","MARIQUINA",22476,14106]
[6891,14106,"ESC.RURAL JUAN POBLETE SAINT-SIMON","MARIQUINA",6891,14106]
[6876,14106,"ESCUELA FRAY BERNABE DE LUCERNA","MARIQUINA",6876,14106]
[6866,14106,"ESCUELA RURAL ALFONSO OSSES PEREZ","MARIQUINA",6866,14106]
[6852,14106,"ESCUELA RURAL JOSE ARNOLDO BILBAO","MARIQUINA",6852,14106]
[6857,14106,"ESCUELA RURAL MISSISSIPPI","MARIQUINA",6857,14106]
[6886,14106,"ESCUELA VALLE DE MARIQUINA","MARIQUINA",6886,14106]
[6853,14106,"LICEO POLITECNICO PESQUERO","MARIQUINA",6853,14106]
[3112,7105,"ESCUELA CALLEJONES","MAULE",3112,7105]
[3114,7105,"ESCUELA CHACARILLA","MAULE",3114,7105]
[3113,7105,"ESCUELA COLIN","MAULE",3113,7105]
[3122,7105,"ESCUELA EL CANELO","MAULE",3122,7105]
[3110,7105,"ESCUELA MAULE","MAULE",3110,7105]
[3118,7105,"ESCUELA QUINIPEUMO","MAULE",3118,7105]
[3115,7105,"ESCUELA RURAL DUAO","MAULE",3115,7105]
[3117,7105,"ESCUELA RURAL NUMPAY","MAULE",3117,7105]
[7834,10108,"ESCUELA ENCARNACION OLIVARES","MAULLIN",7834,10108]
[7833,10108,"ESCUELA JOSE ABELARDO NUÑEZ","MAULLIN",7833,10108]
[7836,10108,"ESCUELA RURAL DORILA AGUILA AGUILAR","MAULLIN",7836,10108]
[7832,10108,"ESCUELA RURAL FRANCISCO CORTES OJEDA","MAULLIN",7832,10108]
[7866,10108,"ESCUELA RURAL HILDA HUNQUEN","MAULLIN",7866,10108]
[7854,10108,"ESCUELA RURAL JUANITA GALLARDO","MAULLIN",7854,10108]
[7850,10108,"ESCUELA RURAL LOS ARCES","MAULLIN",7850,10108]
[368,2102,"ESCUELA BASICA JULIA HERRERA VARAS","MEJILLONES",368,2102]
[19927,9110,"ESCUELA BASICA VOLCAN LLAIMA","MELIPEUCO",19927,9110]
[10784,13501,"COLEGIO HUILCO ALTO","MELIPILLA",10784,13501]
[25089,13501,"COLEGIO LOS JAZMINES","MELIPILLA",25089,13501]
[10785,13501,"COLEGIO MONS. JAIME LARRAIN BUNSTER","MELIPILLA",10785,13501]
[10791,13501,"COLEGIO POMAIRE","MELIPILLA",10791,13501]
[10798,13501,"ESCUELA BASICA CARMEN BAJO","MELIPILLA",10798,13501]
[10827,13501,"ESCUELA BASICA EL PABELLON","MELIPILLA",10827,13501]
[10795,13501,"ESCUELA CLAUDIO ARRAU","MELIPILLA",10795,13501]
[10789,13501,"ESCUELA GRAL. CAROL URZUA","MELIPILLA",10789,13501]
[10818,13501,"ESCUELA HUECHUN","MELIPILLA",10818,13501]
[10816,13501,"ESCUELA JOSE CAMARENA ESCRIVA","MELIPILLA",10816,13501]
[10810,13501,"ESCUELA LIDIA MATTE HURTADO","MELIPILLA",10810,13501]
[10825,13501,"ESCUELA PADRE ALBERTO HURTADO","MELIPILLA",10825,13501]
[10796,13501,"ESCUELA PATRICIO LARRAIN GANDARILLAS","MELIPILLA",10796,13501]
[10797,13501,"ESCUELA PEDRO MARIN ALEMANY","MELIPILLA",10797,13501]
[10805,13501,"ESCUELA PUANGUE","MELIPILLA",10805,13501]
[10799,13501,"ESCUELA RAMON NOGUERA PRIETO","MELIPILLA",10799,13501]
[10821,13501,"ESCUELA RAQUEL FERNANDEZ DE MORANDE","MELIPILLA",10821,13501]
[10790,13501,"ESCUELA REPUBLICA DEL BRASIL","MELIPILLA",10790,13501]
[10786,13501,"ESCUELA SAN JOSE DE LA VILLA","MELIPILLA",10786,13501]
[10794,13501,"ESCUELA SANTA ROSA ESMERALDA","MELIPILLA",10794,13501]
[10783,13501,"LICEO GABRIELA MISTRAL DE MELIPILLA","MELIPILLA",10783,13501]
[10792,13501,"LICEO POLIV. EL BOLLENAR","MELIPILLA",10792,13501]
[2844,7304,"ESC.INTERN.LAS PALMAS TRES ESQUINAS","MOLINA",2844,7304]
[2859,7304,"ESCUELA BAJO LOS ROMEROS","MOLINA",2859,7304]
[2847,7304,"ESCUELA CASA BLANCA","MOLINA",2847,7304]
[2843,7304,"ESCUELA EL PROGRESO","MOLINA",2843,7304]
[2839,7304,"ESCUELA PRESIDENTE EDUARDO FREI MONTALVA","MOLINA",2839,7304]
[2848,7304,"ESCUELA QUECHEREGUAS DE PICHINGAL","MOLINA",2848,7304]
[11323,7304,"ESCUELA REINO DE DINAMARCA","MOLINA",11323,7304]
[2845,7304,"ESCUELA SAN PEDRO DE MOLINA","MOLINA",2845,7304]
[2840,7304,"ESCUELA SUPERIOR DE NINAS DE MOLINA","MOLINA",2840,7304]
[2842,7304,"LUIS MALDONADO BOGGIANO","MOLINA",2842,7304]
[13412,4303,"COLEGIO BASICO RENACER DE CERRILLOS","MONTE PATRIA",13412,4303]
[827,4303,"COLEGIO RIO GRANDE","MONTE PATRIA",827,4303]
[803,4303,"ESC.CONCENTRACION FRONTERIZA DE TULAHUEN","MONTE PATRIA",803,4303]
[848,4303,"ESCUELA ALEJANDRO CHELEN ROJAS","MONTE PATRIA",848,4303]
[13494,4303,"ESCUELA BASICA LA VILLA","MONTE PATRIA",13494,4303]
[839,4303,"ESCUELA CHILECITO","MONTE PATRIA",839,4303]
[821,4303,"ESCUELA DE FLOR DEL VALLE","MONTE PATRIA",821,4303]
[798,4303,"ESCUELA EL PALQUI","MONTE PATRIA",798,4303]
[837,4303,"ESCUELA ESPERANZA DE HUANA","MONTE PATRIA",837,4303]
[800,4303,"ESCUELA HUATULAME","MONTE PATRIA",800,4303]
[822,4303,"ESCUELA JUNTAS","MONTE PATRIA",822,4303]
[833,4303,"ESCUELA SANTA BERNARDITA","MONTE PATRIA",833,4303]
[2223,6110,"COLEGIO ANDRES BELLO","MOSTAZAL",2223,6110]
[2231,6110,"COLEGIO DEL CAMINO REAL","MOSTAZAL",2231,6110]
[2232,6110,"ESC. DE PARV. LAURITA VICUNA","MOSTAZAL",2232,6110]
[2226,6110,"ESC. HIJOS DEL SOL","MOSTAZAL",2226,6110]
[2227,6110,"ESC. SAN FRANCISCO DE ASIS","MOSTAZAL",2227,6110]
[2228,6110,"ESCUELA EL RINCON","MOSTAZAL",2228,6110]
[15748,6110,"ESCUELA ESPECIAL MARIA ALICIA PONCE","MOSTAZAL",15748,6110]
[2224,6110,"LICEO ELVIRA SANCHEZ DE GARCES","MOSTAZAL",2224,6110]
[4406,8305,"ESCUELA BASICA MULCHEN","MULCHEN",4406,8305]
[4410,8305,"ESCUELA BASICA VILLA LAS PENAS","MULCHEN",4410,8305]
[4405,8305,"ESCUELA BLANCO ENCALADA","MULCHEN",4405,8305]
[4407,8305,"ESCUELA IGNACIO VERDUGO CAVADA","MULCHEN",4407,8305]
[4409,8305,"ESCUELA SACERDOTE ALEJANDRO MANERA","MULCHEN",4409,8305]
[17751,8305,"ESCUELA VILLA LA GRANJA","MULCHEN",17751,8305]
[4456,8306,"ESCUELA BASICA DOLLINCO","NACIMIENTO",4456,8306]
[4454,8306,"ESCUELA CANADA","NACIMIENTO",4454,8306]
[4452,8306,"ESCUELA EL SABER","NACIMIENTO",4452,8306]
[17924,8306,"ESCUELA NACIMIENTO DE NUESTRO SEÑOR","NACIMIENTO",17924,8306]
[4453,8306,"ESCUELA OSCAR GUERRERO QUINSAC","NACIMIENTO",4453,8306]
[4455,8306,"ESCUELA TOQUI LAUTARO","NACIMIENTO",4455,8306]
[2525,6305,"COLEGIO BASICO CONSOLIDADO","NANCAGUA",2525,6305]
[2527,6305,"ESCUELA BÁSICA PUQUILLAY","NANCAGUA",2527,6305]
[2528,6305,"ESCUELA BAS. ADRIANA LYON VIAL","NANCAGUA",2528,6305]
[2566,6305,"ESCUELA MUNICIPAL DE CUNACO","NANCAGUA",2566,6305]
[2529,6305,"ESCUELA MUNICIPAL YAQUIL","NANCAGUA",2529,6305]
[8420,12401,"ESC. DE CONCENTRACION FRONTERIZA DOROTEA","NATALES",8420,12401]
[8417,12401,"ESCUELA BAUDILIA AVENDANO DE YOUSSUF","NATALES",8417,12401]
[8415,12401,"ESCUELA CAPITAN JUAN LADRILLERO","NATALES",8415,12401]
[8413,12401,"ESCUELA CORONEL SANTIAGO BUERAS","NATALES",8413,12401]
[8412,12401,"ESCUELA LIB. BERNARDO O┤HIGGINS R.","NATALES",8412,12401]
[2658,6205,"COLEGIO MUNICIPAL DIVINA GABRIELA","NAVIDAD",2658,6205]
[2664,6205,"ESCUELA BASICA CONFEDERACION HELVETICA","NAVIDAD",2664,6205]
[2660,6205,"ESCUELA FRANCISCO CHAVEZ CIFUENTES","NAVIDAD",2660,6205]
[4447,8307,"ESCUELA BASICA RIHUE","NEGRETE",4447,8307]
[4449,8307,"ESCUELA BASICA VAQUERIA","NEGRETE",4449,8307]
[4448,8307,"ESCUELA BASICA VILLA COIGUE","NEGRETE",4448,8307]
[4446,8307,"LICEO POLIVALENTE LA FRONTERA","NEGRETE",4446,8307]
[4130,8408,"ESCUELA BASICA EL RINCON","NINHUE",4130,8408]
[4134,8408,"ESCUELA BASICA TALHUAN","NINHUE",4134,8408]
[17897,8408,"ESCUELA GLORIAS NAVALES","NINHUE",17897,8408]
[4125,8408,"ESCUELA ROSARIO CHACON BARRIOS","NINHUE",4125,8408]
[1445,5506,"ESCUELA BASICA EL MELON","NOGALES",1445,5506]
[1448,5506,"ESCUELA BASICA LA PENA","NOGALES",1448,5506]
[1447,5506,"ESCUELA BASICA ULDA ARACENA GONZALEZ","NOGALES",1447,5506]
[1444,5506,"LICEO MUNICIPAL JUAN RUSQUE PORTAL","NOGALES",1444,5506]
[6611,9111,"ESC. BASICA CHIVILCOYAN","NUEVA IMPERIAL",6611,9111]
[6608,9111,"ESC. BASICA LA ARAUCARIA","NUEVA IMPERIAL",6608,9111]
[6633,9111,"ESC. BASICA SANTA MARIA DE BOROA","NUEVA IMPERIAL",6633,9111]
[6590,9111,"ESC. ESP.RET.MENTAL AVANCEMOS JUNTOS","NUEVA IMPERIAL",6590,9111]
[6587,9111,"ESCUELA ALEJANDRO GOROSTIAGA","NUEVA IMPERIAL",6587,9111]
[6623,9111,"ESCUELA ARENAS BLANCAS","NUEVA IMPERIAL",6623,9111]
[6593,9111,"ESCUELA BASICA EL CRUCERO","NUEVA IMPERIAL",6593,9111]
[6639,9111,"ESCUELA BASICA MANIO DUCANAN","NUEVA IMPERIAL",6639,9111]
[6589,9111,"ESCUELA JUAN XXIII","NUEVA IMPERIAL",6589,9111]
[6588,9111,"ESCUELA REPUBLICA","NUEVA IMPERIAL",6588,9111]
[8409,11302,"ESCUELA PIONEROS DEL SUR","O'HIGGINS",8409,11302]
[2262,6111,"COL.MARIA VILLALOBOS ARTEAGA","OLIVAR",2262,6111]
[2263,6111,"ESCUELA MUNICIPAL DE GULTRO","OLIVAR",2263,6111]
[2264,6111,"ESCUELA NUESTRA SRA. DE LA MERCED","OLIVAR",2264,6111]
[12314,5803,"ESCUELA ATENAS","OLMUE",12314,5803]
[1490,5803,"ESCUELA BÁSICA QUEBRADA DE ALVARADO","OLMUE",1490,5803]
[1491,5803,"ESCUELA BASICA LO NARVAEZ","OLMUE",1491,5803]
[14209,5803,"ESCUELA ESPECIAL HELLEN KELLER","OLMUE",14209,5803]
[1493,5803,"ESCUELA LA DORMIDA","OLMUE",1493,5803]
[1496,5803,"ESCUELA LAS PALMAS DEL NIÑO DIOS","OLMUE",1496,5803]
[1488,5803,"ESCUELA MONTEVIDEO","OLMUE",1488,5803]
[7348,10301,"ESCUELA CARLOS CONDELL","OSORNO",7348,10301]
[7340,10301,"ESCUELA CLAUDIO ARRAU","OSORNO",7340,10301]
[7349,10301,"ESCUELA DE ARTES Y CULTURA OSORNO","OSORNO",7349,10301]
[7334,10301,"ESCUELA EFRAIN CAMPANA SILVA","OSORNO",7334,10301]
[7333,10301,"ESCUELA ESPAÑA","OSORNO",7333,10301]
[7336,10301,"ESCUELA FUNDACION PAUL HARRIS","OSORNO",7336,10301]
[7337,10301,"ESCUELA GARCIA HURTADO DE MENDOZA","OSORNO",7337,10301]
[7332,10301,"ESCUELA JUAN RICARDO SANCHEZ ASCENCIO","OSORNO",7332,10301]
[7347,10301,"ESCUELA LAGO RUPANCO","OSORNO",7347,10301]
[7338,10301,"ESCUELA LEONILA FOLCH LOPEZ","OSORNO",7338,10301]
[7343,10301,"ESCUELA MEXICO DE MICHOACAN","OSORNO",7343,10301]
[7341,10301,"ESCUELA MONSEÑOR FRANCISCO VALDES SUBERCASEAUX","OSORNO",7341,10301]
[7346,10301,"ESCUELA N. 46 ITALIA","OSORNO",7346,10301]
[7339,10301,"ESCUELA N.88 CANADA","OSORNO",7339,10301]
[7407,10301,"ESCUELA PARVULARIA `PEDRO AGUIRRE CERDA`","OSORNO",7407,10301]
[7355,10301,"ESCUELA RURAL EMILIO SURBER SCHULZ","OSORNO",7355,10301]
[7354,10301,"ESCUELA RURAL LUZ Y SABER","OSORNO",7354,10301]
[7369,10301,"ESCUELA RURAL PICHIL","OSORNO",7369,10301]
[7377,10301,"ESCUELA RURAL WALTERIO MEYER RUSCA","OSORNO",7377,10301]
[7352,10301,"ESCUELA SOCIEDAD DE SOCORRO DE SEÑORAS","OSORNO",7352,10301]
[7335,10301,"ESCUELA SUIZA","OSORNO",7335,10301]
[13590,4301,"COLEGIO DE ADMINISTRACION Y COMERCIO EL INGENIO","OVALLE",13590,4301]
[13387,4301,"COLEGIO DE ARTES ELISEO VIDELA JORQUERA","OVALLE",13387,4301]
[706,4301,"COLEGIO FRAY JORGE","OVALLE",706,4301]
[719,4301,"COLEGIO YUNGAY","OVALLE",719,4301]
[722,4301,"ESC. HEBERTO VELAZQUEZ VELAZQUEZ","OVALLE",722,4301]
[753,4301,"ESC.BAS.JUAN PABLO ARTIGUES PENAFIEL","OVALLE",753,4301]
[910,4301,"ESC.BASICA SAN ANTONIO DE LA VILLA","OVALLE",910,4301]
[716,4301,"ESC.PADRE JOSEPH BENEDIKT STEGMEIER","OVALLE",716,4301]
[937,4301,"ESCUELA ALCONES BAJOS","OVALLE",937,4301]
[708,4301,"ESCUELA ANTONIO TIRADO LANAS","OVALLE",708,4301]
[713,4301,"ESCUELA ARTURO VILLALON SIEULANNE","OVALLE",713,4301]
[947,4301,"ESCUELA AURORA DE CHILE","OVALLE",947,4301]
[712,4301,"ESCUELA BÁSICA ARTURO ALESSANDRI PALMA","OVALLE",712,4301]
[715,4301,"ESCUELA BASICA BERNARDO OªHIGGINS RIQUELME","OVALLE",715,4301]
[757,4301,"ESCUELA BASICA EL GUINDO","OVALLE",757,4301]
[721,4301,"ESCUELA BASICA FLORENCIO ESPINOZA LOPEZ","OVALLE",721,4301]
[707,4301,"ESCUELA BASICA HELENE LANG","OVALLE",707,4301]
[710,4301,"ESCUELA BASICA JOSE TOMAS OVALLE B.","OVALLE",710,4301]
[729,4301,"ESCUELA BASICA LOS OLIVOS","OVALLE",729,4301]
[730,4301,"ESCUELA BASICA LUCIA NUNEZ DE LA CUADRA","OVALLE",730,4301]
[709,4301,"ESCUELA BASICA OSCAR ARAYA MOLINA","OVALLE",709,4301]
[737,4301,"ESCUELA BASICA VALENTIN LETELIER","OVALLE",737,4301]
[714,4301,"ESCUELA BASICA VISTA HERMOSA","OVALLE",714,4301]
[743,4301,"ESCUELA CARACHILLA","OVALLE",743,4301]
[747,4301,"ESCUELA CERRO TAMAYA","OVALLE",747,4301]
[905,4301,"ESCUELA CHALINGA","OVALLE",905,4301]
[725,4301,"ESCUELA EL CRISOL","OVALLE",725,4301]
[731,4301,"ESCUELA EL TRAPICHE","OVALLE",731,4301]
[750,4301,"ESCUELA ELVIRA DEL CARMEN OCHOA AVILES","OVALLE",750,4301]
[711,4301,"ESCUELA GUARDIAMARINA ERNESTO RIQUELME V","OVALLE",711,4301]
[924,4301,"ESCUELA LOS ACACIOS","OVALLE",924,4301]
[929,4301,"ESCUELA LOS NOGALES","OVALLE",929,4301]
[718,4301,"ESCUELA MARCOS MACUADA OGALDE","OVALLE",718,4301]
[915,4301,"ESCUELA MARCOS RIGOBERTO PIZARRO ARAYA","OVALLE",915,4301]
[733,4301,"ESCUELA PADRE DAMIAN HEREDIA","OVALLE",733,4301]
[740,4301,"ESCUELA PEDRO ENRIQUE ALFONSO BARRIOS","OVALLE",740,4301]
[908,4301,"ESCUELA TABALI","OVALLE",908,4301]
[932,4301,"ESCUELA UNION CAMPESINA","OVALLE",932,4301]
[10763,13604,"ESCUELA CRISTAL CHILE","PADRE HURTADO",10763,13604]
[10764,13604,"ESCUELA LA ESPERANZA","PADRE HURTADO",10764,13604]
[10752,13604,"ESCUELA REPUBLICA ARGENTINA","PADRE HURTADO",10752,13604]
[10749,13604,"LICEO PAUL HARRIS","PADRE HURTADO",10749,13604]
[5648,9112,"ESCUELA CHAPOD","PADRE LAS CASAS",5648,9112]
[5646,9112,"ESCUELA CHOMIO","PADRE LAS CASAS",5646,9112]
[5638,9112,"ESCUELA COLPANAO","PADRE LAS CASAS",5638,9112]
[5599,9112,"ESCUELA DARIO SALAS","PADRE LAS CASAS",5599,9112]
[5649,9112,"ESCUELA FUNDO MAQUEHUE","PADRE LAS CASAS",5649,9112]
[5627,9112,"ESCUELA LAUREL HUACHO","PADRE LAS CASAS",5627,9112]
[5631,9112,"ESCUELA LICANCO","PADRE LAS CASAS",5631,9112]
[5624,9112,"ESCUELA METRENCO","PADRE LAS CASAS",5624,9112]
[5634,9112,"ESCUELA NIRRIMAPU","PADRE LAS CASAS",5634,9112]
[5635,9112,"ESCUELA TROMEN","PADRE LAS CASAS",5635,9112]
[5625,9112,"ESCUELA TRUF-TRUF.","PADRE LAS CASAS",5625,9112]
[5623,9112,"ESCUELA TRUMPULO CHICO","PADRE LAS CASAS",5623,9112]
[694,4105,"ESCUELA GABRIELA MISTRAL","PAIGUANO",694,4105]
[692,4105,"ESCUELA JERONIMO GODOY VILLANUEVA","PAIGUANO",692,4105]
[686,4105,"ESCUELA MARIO AQUILES RODRIGUEZ","PAIGUANO",686,4105]
[691,4105,"ESCUELA MUNICIPAL CIELO CLARO--PAIHUANO","PAIGUANO",691,4105]
[7204,14107,"ESCUELA NUEVA AURORA","PAILLACO",7204,14107]
[7203,14107,"ESCUELA OLEGARIO MORALES OLIVA","PAILLACO",7203,14107]
[7202,14107,"ESCUELA PROYECTO DE FUTURO","PAILLACO",7202,14107]
[7205,14107,"ESCUELA ROBERTO OJEDA TORRES","PAILLACO",7205,14107]
[7206,14107,"ESCUELA RURAL 21 DE MAYO","PAILLACO",7206,14107]
[6990,14107,"ESCUELA RURAL EL LLOLLY","PAILLACO",6990,14107]
[7217,14107,"ESCUELA RURAL ESTRELLA DE CHILE","PAILLACO",7217,14107]
[10672,13404,"COLEGIO CHALLAY","PAINE",10672,13404]
[25711,13404,"ESC. BASICA MUNICIPAL PAULA JARAQUEMADA ALQUI","PAINE",25711,13404]
[10665,13404,"ESCUELA ALEMANIA","PAINE",10665,13404]
[10669,13404,"ESCUELA BARBARA KAST RIST","PAINE",10669,13404]
[10673,13404,"ESCUELA BASICA F-N°835 HERMANOS SANCHEZ CERDA","PAINE",10673,13404]
[10677,13404,"ESCUELA BASICA G N°831 JAVIER EYZAGUIRRE ECHAURREN","PAINE",10677,13404]
[10676,13404,"ESCUELA BASICA G-N°830 FRANCISCO LETELIER VALDES","PAINE",10676,13404]
[10679,13404,"ESCUELA BASICA G-N°832 AGUILA SUR","PAINE",10679,13404]
[10671,13404,"ESCUELA CARMEN REVECO NUNEZ","PAINE",10671,13404]
[10666,13404,"ESCUELA DE HOSPITAL","PAINE",10666,13404]
[10668,13404,"ESCUELA ELIAS SANCHEZ ORTUZAR","PAINE",10668,13404]
[10680,13404,"ESCUELA HUGO PINO VILCHEZ","PAINE",10680,13404]
[10675,13404,"ESCUELA LAS COLONIAS","PAINE",10675,13404]
[10674,13404,"ESCUELA SENDERO DE CULITRIN","PAINE",10674,13404]
[10667,13404,"LICEO MARIA CARVAJAL FUENZALIDA","PAINE",10667,13404]
[8339,10404,"ESCUELA ROBERTO WHITE GESELL","PALENA",8339,10404]
[2615,6306,"ESCUELA JORGE ERRAZURIZ ECHEÑIQUE","PALMILLA",2615,6306]
[2611,6306,"ESCUELA MUNICIPAL DE PALMILLA","PALMILLA",2611,6306]
[2624,6306,"ESCUELA MUNICIPAL LIHUEIMO","PALMILLA",2624,6306]
[2613,6306,"ESCUELA MUNICIPAL SANTA MATILDE","PALMILLA",2613,6306]
[2621,6306,"ESCUELA REBECA CADIZ VALENZUELA","PALMILLA",2621,6306]
[2612,6306,"LICEO SAN JOSE DEL CARMEN","PALMILLA",2612,6306]
[7049,14108,"CENTRO EDUCATIVO FERNANDO SANTIVAN","PANGUIPULLI",7049,14108]
[7085,14108,"COMPLEJO EDUCACIONAL TIERRA DE ESPERANZA","PANGUIPULLI",7085,14108]
[7064,14108,"ESCUELA BASICA REPUBLICA DE CHILE","PANGUIPULLI",7064,14108]
[22531,14108,"ESCUELA CLAUDIO ARRAU LEON","PANGUIPULLI",22531,14108]
[7059,14108,"ESCUELA MANUEL ANABALÓN SÁEZ","PANGUIPULLI",7059,14108]
[7050,14108,"ESCUELA MARIA ALVARADO GARAY","PANGUIPULLI",7050,14108]
[7063,14108,"ESCUELA RURAL HUELLAHUE","PANGUIPULLI",7063,14108]
[7061,14108,"ESCUELA RURAL LA RINCONADA","PANGUIPULLI",7061,14108]
[7071,14108,"ESCUELA RURAL LAGO AZUL","PANGUIPULLI",7071,14108]
[7062,14108,"ESCUELA RURAL PULLINQUE","PANGUIPULLI",7062,14108]
[7092,14108,"ESCUELA RURAL REHUEICO","PANGUIPULLI",7092,14108]
[1331,5704,"ESCUELA BASICA FRAY CAMILO HENRIQUEZ","PANQUEHUE",1331,5704]
[1332,5704,"ESCUELA BASICA VINA ERRAZURIZ","PANQUEHUE",1332,5704]
[1329,5704,"ESCUELA EMA LOBOS REYES","PANQUEHUE",1329,5704]
[1328,5704,"ESCUELA INDEPENDENCIA","PANQUEHUE",1328,5704]
[1333,5704,"ESCUELA JORGE BARROS BEAUCHEF","PANQUEHUE",1333,5704]
[1191,5403,"ESCUELA PAPUDO","PAPUDO",1191,5403]
[1192,5403,"ESCUELA RURAL PULLALLY","PAPUDO",1192,5403]
[2715,6206,"ESC.BASICA MERCEDES URZUA DIAZ","PAREDONES",2715,6206]
[2717,6206,"ESCUELA MUNICIPAL ALBERTINA VALENZUELA","PAREDONES",2717,6206]
[2725,6206,"ESCUELA MUNICIPAL LO VALDIVIA","PAREDONES",2725,6206]
[2716,6206,"ESCUELA MUNICIPAL SAN PEDRO DE ALCANTARA","PAREDONES",2716,6206]
[2637,6206,"ESCUELA MUNICIPAL VILLA SAN PEDRO","PAREDONES",2637,6206]
[2714,6206,"ESCUELA UNION DE MUJERES AMERICANAS","PAREDONES",2714,6206]
[3405,7404,"ESCUELA ARMANDO GUZMAN MORALES","PARRAL",3405,7404]
[3393,7404,"ESCUELA ARRAU MENDEZ","PARRAL",3393,7404]
[3401,7404,"ESCUELA EL LIBERTADOR","PARRAL",3401,7404]
[3408,7404,"ESCUELA FRANCISCO MAUREIRA","PARRAL",3408,7404]
[3402,7404,"ESCUELA FRANCISCO PEREZ LAVIN","PARRAL",3402,7404]
[3404,7404,"ESCUELA IGNACIO URRUTIA DE LA SOTTA","PARRAL",3404,7404]
[3398,7404,"ESCUELA JOSE MATTA CALLEJON","PARRAL",3398,7404]
[3390,7404,"ESCUELA LUIS ARMANDO GOMEZ MUNOZ","PARRAL",3390,7404]
[3395,7404,"ESCUELA NIDER ORREGO QUEVEDO","PARRAL",3395,7404]
[3389,7404,"ESCUELA SANTIAGO URRUTIA BENAVENTE","PARRAL",3389,7404]
[10765,13605,"ESCUELA BASICA G-N°673 PELVIN SAN FRANCISCO DE ASIS","PEÑAFLOR",10765,13605]
[10755,13605,"ESCUELA DIFERENCIAL ALEGRIA DE VIVIR","PEÑAFLOR",10755,13605]
[10748,13605,"ESCUELA EMILIA LASCAR","PEÑAFLOR",10748,13605]
[10758,13605,"ESCUELA MALLOCO","PEÑAFLOR",10758,13605]
[10754,13605,"ESCUELA MAND EDUARDO FREI MONTALVA","PEÑAFLOR",10754,13605]
[10753,13605,"ESCUELA REPUBLICA CHECA","PEÑAFLOR",10753,13605]
[10760,13605,"ESCUELA REPUBLICA DE ISRAEL","PEÑAFLOR",10760,13605]
[10750,13605,"ESCUELA ROSALINA PESCIO VARGAS","PEÑAFLOR",10750,13605]
[10756,13605,"ESCUELA SONIA PLAZA CASTRO","PEÑAFLOR",10756,13605]
[10747,13605,"ESCUELA TERESA DE CALCUTA","PEÑAFLOR",10747,13605]
[9087,13122,"CENTRO EDUC. VALLE HERMOSO","PEÑALOLEN",9087,13122]
[9106,13122,"CENTRO EDUCACION MARIANO EGANA","PEÑALOLEN",9106,13122]
[9127,13122,"COLEGIO LIKANKURA DE PEÑALOLÉN","PEÑALOLEN",9127,13122]
[9110,13122,"ESCUELA CARLOS HERNANDEZ PENA","PEÑALOLEN",9110,13122]
[9117,13122,"ESCUELA E-180 MATILDE HUICI NAVAS","PEÑALOLEN",9117,13122]
[12249,13122,"ESCUELA ESPECIAL PONTIFICE JUAN PABLO II","PEÑALOLEN",12249,13122]
[9098,13122,"ESCUELA JUAN BAUTISTA PASTEN","PEÑALOLEN",9098,13122]
[9111,13122,"ESCUELA LUIS ARRIETA CANAS","PEÑALOLEN",9111,13122]
[24997,13122,"ESCUELA SANTA MARIA DE PENALOLEN","PEÑALOLEN",24997,13122]
[9121,13122,"ESCUELA TOBALABA","PEÑALOLEN",9121,13122]
[9103,13122,"ESCUELA UNION NACIONAL ARABE","PEÑALOLEN",9103,13122]
[9088,13122,"LICEO ANTONIO HERMIDA FABRES","PEÑALOLEN",9088,13122]
[9738,13121,"COLEGIO PARQUE LAS AMERICAS","PEDRO AGUIRRE CERDA",9738,13121]
[25173,13121,"ESC. BASICA MUNICIPAL RISOPATRON","PEDRO AGUIRRE CERDA",25173,13121]
[9428,13121,"ESCUELA BASICA RICARDO E. LATCHMAN","PEDRO AGUIRRE CERDA",9428,13121]
[9458,13121,"ESCUELA BOROA","PEDRO AGUIRRE CERDA",9458,13121]
[9422,13121,"ESCUELA CENTRO EDUC. REP. MEXICANA","PEDRO AGUIRRE CERDA",9422,13121]
[9727,13121,"ESCUELA CIUDAD DE BARCELONA","PEDRO AGUIRRE CERDA",9727,13121]
[9410,13121,"ESCUELA CONSOLIDADA DAVILA","PEDRO AGUIRRE CERDA",9410,13121]
[9446,13121,"ESCUELA DE PARVULOS RAYITO DE LUZ","PEDRO AGUIRRE CERDA",9446,13121]
[9704,13121,"ESCUELA LO VALLEDOR","PEDRO AGUIRRE CERDA",9704,13121]
[9416,13121,"ESCUELA POETAS DE CHILE","PEDRO AGUIRRE CERDA",9416,13121]
[9729,13121,"ESCUELA VILLA SUR","PEDRO AGUIRRE CERDA",9729,13121]
[9419,13121,"LICEO MUNICIPAL ENRIQUE BACKAUSSE","PEDRO AGUIRRE CERDA",9419,13121]
[9695,13121,"LICEO POLIVALENTE EUGENIO PEREIRA SALAS","PEDRO AGUIRRE CERDA",9695,13121]
[3023,7106,"ESCUELA EL MANZANO","PELARCO",3023,7106]
[3019,7106,"ESCUELA HERNAN CIUDAD INOSTROZA","PELARCO",3019,7106]
[3022,7106,"ESCUELA PABLO CORREA MONTT","PELARCO",3022,7106]
[3016,7106,"LICEO DE PELARCO","PELARCO",3016,7106]
[3616,7203,"ESCUELA BENITO MANCILLA PEREZ","PELLUHUE",3616,7203]
[3610,7203,"ESCUELA GLADYS CANALES PAREDES","PELLUHUE",3610,7203]
[3611,7203,"ESCUELLA BLANCA BUSTOS CASTILLO","PELLUHUE",3611,7203]
[3609,7203,"LICEO PELLUHUE","PELLUHUE",3609,7203]
[3972,8410,"ESCUELA ARTURO MATTE ALESSANDRI","PEMUCO",3972,8410]
[3967,8410,"ESCUELA BASICA GENERAL CRUZ","PEMUCO",3967,8410]
[3974,8410,"ESCUELA BASICA VALLE HERMOSO","PEMUCO",3974,8410]
[17916,8410,"ESCUELA DAFNE ELVIRA ZAPATA ROZAS","PEMUCO",17916,8410]
[3971,8410,"ESCUELA JOSÉ RENÉ SALGADO","PEMUCO",3971,8410]
[3138,7107,"COMPLEJO EDUCACIONAL PENCAHUE","PENCAHUE",3138,7107]
[3140,7107,"ESCUELA CORINTO","PENCAHUE",3140,7107]
[11333,7107,"ESCUELA OSVALDO HIRIART CORVALAN","PENCAHUE",11333,7107]
[3139,7107,"ESCUELA PADRE LUIS OLIVA NAVARRETE","PENCAHUE",3139,7107]
[3143,7107,"ESCUELA SANTA LAURA DE LO FIGUEROA","PENCAHUE",3143,7107]
[4810,8107,"ESCUELA ALMIRANTE JORGE MONTT ÁLVAREZ","PENCO",4810,8107]
[4811,8107,"ESCUELA ALMIRANTE PATRICIO LYNCH","PENCO",4811,8107]
[18015,8107,"ESCUELA BASICA FORJADORES DE CHILE","PENCO",18015,8107]
[18014,8107,"ESCUELA BASICA LOS CONQUISTADORES","PENCO",18014,8107]
[4809,8107,"ESCUELA EDUARDO CAMBELL SAAVEDRA","PENCO",4809,8107]
[4814,8107,"ESCUELA ETHEL HENCK DE GRANT","PENCO",4814,8107]
[4807,8107,"ESCUELA ISLA DE PASCUA","PENCO",4807,8107]
[4812,8107,"ESCUELA LA GREDA","PENCO",4812,8107]
[4808,8107,"ESCUELA PENCO","PENCO",4808,8107]
[4806,8107,"ESCUELA REPUBLICA DE ITALIA","PENCO",4806,8107]
[4813,8107,"ESCUELA VIPLA","PENCO",4813,8107]
[17782,8107,"LICEO RIOS DE CHILE","PENCO",17782,8107]
[15812,6307,"COLEGIO BASICO VIOLETA PARRA SANDOVAL","PERALILLO",15812,6307]
[2626,6307,"COLEGIO MANUEL RODRIGUEZ ERDOIZA","PERALILLO",2626,6307]
[2627,6307,"ESCUELA GUSTAVO RIVERA BUSTOS","PERALILLO",2627,6307]
[5880,9113,"ESCUELA EDUARDO FREI MONTALVA","PERQUENCO",5880,9113]
[1157,5404,"ESCUELA BASICA LOS ALAMOS EL SOBRANTE","PETORCA",1157,5404]
[1161,5404,"ESCUELA BASICA PEDEGUA","PETORCA",1161,5404]
[1152,5404,"ESCUELA EDUARDO FREI MONTALVA","PETORCA",1152,5404]
[1147,5404,"ESCUELA FERNANDO GARCIA OLDINI","PETORCA",1147,5404]
[1160,5404,"ESCUELA HOGAR FRONTERIZA DE CHALACO","PETORCA",1160,5404]
[1149,5404,"LICEO CORDILLERA","PETORCA",1149,5404]
[1148,5404,"LICEO JOSE MANUEL BORGONO NUNEZ","PETORCA",1148,5404]
[2379,6112,"ESCUELA BASICA ANTONIO DE ZUNIGA","PEUMO",2379,6112]
[2384,6112,"ESCUELA BASICA ROSARIO DE CODAO","PEUMO",2384,6112]
[2381,6112,"ESCUELA JUAN VALDES ORTUZAR","PEUMO",2381,6112]
[2380,6112,"ESCUELA MUNICIPAL ALCALDE G. BURMESTER","PEUMO",2380,6112]
[188,1405,"ESC. MATILLA DE NUEVA EXTREMADURA","PICA",188,1405]
[12623,1405,"ESCUELA SAN ANDRES DE PICA","PICA",12623,1405]
[187,1405,"ESCUELA VERTIENTE DEL SABER","PICA",187,1405]
[2362,6113,"ESCUELA AMELIA LYNCH DE LYON","PICHIDEGUA",2362,6113]
[2367,6113,"ESCUELA BASICA JOSE BERNALES CASTILLO","PICHIDEGUA",2367,6113]
[2365,6113,"ESCUELA BASICA PATAGUAS CERRO","PICHIDEGUA",2365,6113]
[2373,6113,"ESCUELA BASICA SAN JOSE","PICHIDEGUA",2373,6113]
[2361,6113,"ESCUELA ENRIQUE SERRANO DE VIALE RIGO","PICHIDEGUA",2361,6113]
[15780,6113,"ESCUELA ESPECIAL DE PICHIDEGUA","PICHIDEGUA",15780,6113]
[2359,6113,"ESCUELA LARMAHUE","PICHIDEGUA",2359,6113]
[2374,6113,"ESCUELA MUNICIPAL DE CALEUCHE","PICHIDEGUA",2374,6113]
[2363,6113,"ESCUELA MUNICIPAL DE SAN ROBERTO","PICHIDEGUA",2363,6113]
[2372,6113,"ESCUELA MUNICIPAL EL SALTO","PICHIDEGUA",2372,6113]
[2364,6113,"ESCUELA REINO DE DINAMARCA","PICHIDEGUA",2364,6113]
[2654,6201,"COLEGIO LIBERTADORES","PICHILEMU",2654,6201]
[11261,6201,"ESCUELA DIGNA CAMILO","PICHILEMU",11261,6201]
[15770,6201,"ESCUELA DIVINO MAESTRO","PICHILEMU",15770,6201]
[2636,6201,"ESCUELA PUEBLO DE VIUDAS","PICHILEMU",2636,6201]
[3883,8411,"ESCUELA BASICA JUAN JORGE","PINTO",3883,8411]
[3876,8411,"ESCUELA HECTOR MANUEL ARIAS CORTES","PINTO",3876,8411]
[3874,8411,"ESCUELA JAVIER JARPA SOTOMAYOR","PINTO",3874,8411]
[3872,8411,"ESCUELA JOSE TOHA SOLDEVILLA","PINTO",3872,8411]
[11704,8411,"ESCUELA PUERTA DE LA CORDILLERA","PINTO",11704,8411]
[10524,13202,"ESCUELA BASICA G-841 SANTOS RUBIO MORALES","PIRQUE",10524,13202]
[10522,13202,"ESCUELA BASICA G-N°643 SAN JUAN DE PIRQUE","PIRQUE",10522,13202]
[10519,13202,"ESCUELA BASICA G-N°646 LO ARCAYA","PIRQUE",10519,13202]
[10520,13202,"LICEO EL PRINCIPAL","PIRQUE",10520,13202]
[10516,13202,"LICEO MUNIC. TEC. PROF. EL LLANO","PIRQUE",10516,13202]
[6225,9114,"ESCUELA JUAN BTA. CHESTA CH.","PITRUFQUEN",6225,9114]
[6227,9114,"ESCUELA LAS AMERICAS","PITRUFQUEN",6227,9114]
[6224,9114,"ESCUELA UNION LATINOAMERICANA","PITRUFQUEN",6224,9114]
[6230,9114,"LICEO MUNICIPAL LA FRONTERA","PITRUFQUEN",6230,9114]
[2519,6308,"ESCUELA BASICA RAUL CACERES PACHECO","PLACILLA",2519,6308]
[2524,6308,"ESCUELA DANY GERMAN GONZALEZ SOTO","PLACILLA",2524,6308]
[2523,6308,"ESCUELA EL AMANECER","PLACILLA",2523,6308]
[2520,6308,"ESCUELA MUNICIPAL LA DEHESA","PLACILLA",2520,6308]
[2521,6308,"ESCUELA MUNICIPAL LA TUNA","PLACILLA",2521,6308]
[2518,6308,"LICEO SAN FRANCISCO","PLACILLA",2518,6308]
[4034,8412,"ESCUELA LOMAS DE CHUDAL","PORTEZUELO",4034,8412]
[4032,8412,"LICEO NIBALDO SEPULVEDA FERNANDEZ","PORTEZUELO",4032,8412]
[8475,12301,"ESCUELA LIBERTADOR BDO. O┤HIGGINS R.","PORVENIR",8475,12301]
[10905,1401,"ESCUELA BASICA FUERTE BAQUEDANO","POZO ALMONTE",10905,1401]
[198,1401,"ESCUELA BASICA LA HUAYCA","POZO ALMONTE",198,1401]
[195,1401,"ESCUELA BASICA LA TIRANA","POZO ALMONTE",195,1401]
[192,1401,"ESCUELA BASICA MAMINA","POZO ALMONTE",192,1401]
[193,1401,"ESCUELA BASICA POZO ALMONTE","POZO ALMONTE",193,1401]
[12617,1401,"ESCUELA ESTRELLA DEL SUR","POZO ALMONTE",12617,1401]
[12550,1401,"OASIS EN EL DESIERTO","POZO ALMONTE",12550,1401]
[8479,12302,"ESCUELA CERRO SOMBRERO","PRIMAVERA",8479,12302]
[26176,13123,"ESC. DE PARV. MADRE BERNARDA MORIN DE PROVIDE","PROVIDENCIA",26176,13123]
[8934,13123,"ESCUELA ABELARDO ITURRIAGA JAMETT","PROVIDENCIA",8934,13123]
[11993,13123,"ESCUELA BASICA JUAN PABLO DUARTE","PROVIDENCIA",11993,13123]
[1863,5105,"COLEGIO GENERAL JOSE VELASQUEZ BORQUEZ","PUCHUNCAVI",1863,5105]
[1864,5105,"COMPLEJO EDUCACIONAL SARGENTO ALDEA","PUCHUNCAVI",1864,5105]
[1871,5105,"ESCUELA BASICA EL RINCON","PUCHUNCAVI",1871,5105]
[1874,5105,"ESCUELA BASICA LA LAGUNA","PUCHUNCAVI",1874,5105]
[1873,5105,"ESCUELA HORCON","PUCHUNCAVI",1873,5105]
[1868,5105,"ESCUELA LA CHOCOTA","PUCHUNCAVI",1868,5105]
[1867,5105,"ESCUELA LA GREDA","PUCHUNCAVI",1867,5105]
[1875,5105,"ESCUELA MAITENCILLO","PUCHUNCAVI",1875,5105]
[14829,5105,"ESCUELA MULTIDEFICIT AMANECER","PUCHUNCAVI",14829,5105]
[6066,9115,"ESC. BASICA CARILEUFU","PUCON",6066,9115]
[6069,9115,"ESC.BASICA PAILLACO","PUCON",6069,9115]
[6056,9115,"ESCUELA BASICA MUNICIPAL DE EL CLARO","PUCON",6056,9115]
[6052,9115,"ESCUELA CARLOS HOLZAFEL","PUCON",6052,9115]
[20121,9115,"ESCUELA MUNICIPAL LOS ARRAYANES","PUCON",20121,9115]
[24412,13124,"COLEGIO FINLANDIA","PUDAHUEL",24412,13124]
[10134,13124,"ESC.COMODORO ARTURO MERINO BENITEZ","PUDAHUEL",10134,13124]
[10102,13124,"ESCUELA ALBERT EINSTEIN","PUDAHUEL",10102,13124]
[10090,13124,"ESCUELA ALEXANDER GRAHAM BELL","PUDAHUEL",10090,13124]
[25047,13124,"ESCUELA ANTILHUE DE PUDAHUEL","PUDAHUEL",25047,13124]
[10123,13124,"ESCUELA BASICA MELVIN JONES","PUDAHUEL",10123,13124]
[10100,13124,"ESCUELA EL SALITRE","PUDAHUEL",10100,13124]
[10113,13124,"ESCUELA ELVIRA SANTA CRUZ OSSA","PUDAHUEL",10113,13124]
[10085,13124,"ESCUELA ESTADO DE FLORIDA","PUDAHUEL",10085,13124]
[10081,13124,"ESCUELA ESTRELLA DE CHILE","PUDAHUEL",10081,13124]
[10135,13124,"ESCUELA LO BOZA","PUDAHUEL",10135,13124]
[10104,13124,"ESCUELA MONSENOR CARLOS OVIEDO","PUDAHUEL",10104,13124]
[25315,13124,"ESCUELA PUERTO FUTURO","PUDAHUEL",25315,13124]
[10124,13124,"ESCUELA SAN DANIEL","PUDAHUEL",10124,13124]
[10080,13124,"ESCUELA TENIENTE HERNAN MERINO CORREA","PUDAHUEL",10080,13124]
[10130,13124,"LICEO CIUDAD DE BRASILIA","PUDAHUEL",10130,13124]
[24889,13124,"LICEO MONSENOR ENRIQUE ALVEAR","PUDAHUEL",24889,13124]
[10460,13201,"CENTRO EDUCACIONAL NUEVA CREACION","PUENTE ALTO",10460,13201]
[24987,13201,"ESCUELA ANDES DEL SUR","PUENTE ALTO",24987,13201]
[25002,13201,"ESCUELA BASICA PADRE ALBERTO HURTADO","PUENTE ALTO",25002,13201]
[10472,13201,"ESCUELA CASAS VIEJAS","PUENTE ALTO",10472,13201]
[10450,13201,"ESCUELA CONSOLIDADA","PUENTE ALTO",10450,13201]
[10465,13201,"ESCUELA EJERCITO LIBERTADOR","PUENTE ALTO",10465,13201]
[10476,13201,"ESCUELA LAS PALMAS","PUENTE ALTO",10476,13201]
[10461,13201,"ESCUELA LOS ANDES","PUENTE ALTO",10461,13201]
[10474,13201,"ESCUELA LUIS MATTE LARRAIN","PUENTE ALTO",10474,13201]
[10473,13201,"ESCUELA OSCAR BONILLA","PUENTE ALTO",10473,13201]
[10459,13201,"ESCUELA REPUBLICA DE GRECIA","PUENTE ALTO",10459,13201]
[10458,13201,"ESCUELA VILLA INDEPENDENCIA","PUENTE ALTO",10458,13201]
[25043,13201,"ESCUELA VOLCAN SAN JOSE","PUENTE ALTO",25043,13201]
[10470,13201,"LICEO MUNIC.ING.MILITAR JUAN MACKENA O.","PUENTE ALTO",10470,13201]
[24443,13201,"LICEO MUNICIPAL CHILOE","PUENTE ALTO",24443,13201]
[10455,13201,"LICEO SAN GERONIMO","PUENTE ALTO",10455,13201]
[7639,10101,"COLEGIO DARIO SALAS","PUERTO MONTT",7639,10101]
[22480,10101,"COLEGIO LOS ALERCES","PUERTO MONTT",22480,10101]
[7672,10101,"ESCUEAL RURAL CHAICAS","PUERTO MONTT",7672,10101]
[22509,10101,"ESCUELA ALEMANIA","PUERTO MONTT",22509,10101]
[7659,10101,"ESCUELA ALERCE HISTORICO","PUERTO MONTT",7659,10101]
[7696,10101,"ESCUELA ANAHUAC","PUERTO MONTT",7696,10101]
[22418,10101,"ESCUELA BASICA KIMUN LAWAL","PUERTO MONTT",22418,10101]
[22686,10101,"ESCUELA BASICA LAS CAMELIAS","PUERTO MONTT",22686,10101]
[22229,10101,"ESCUELA BASICA LICARAYEN","PUERTO MONTT",22229,10101]
[7644,10101,"ESCUELA BASICA SANTA INES","PUERTO MONTT",7644,10101]
[7641,10101,"ESCUELA BELLAVISTA","PUERTO MONTT",7641,10101]
[7633,10101,"ESCUELA CAPITAN ARTURO PRAT CHACON","PUERTO MONTT",7633,10101]
[7664,10101,"ESCUELA CAYENEL","PUERTO MONTT",7664,10101]
[7643,10101,"ESCUELA CHILOE","PUERTO MONTT",7643,10101]
[7645,10101,"ESCUELA DIFERENCIAL `LOS EUCALIPTOS`","PUERTO MONTT",7645,10101]
[7642,10101,"ESCUELA LA COLINA","PUERTO MONTT",7642,10101]
[7647,10101,"ESCUELA LIBERTAD","PUERTO MONTT",7647,10101]
[7648,10101,"ESCUELA MARCELA PAZ","PUERTO MONTT",7648,10101]
[7634,10101,"ESCUELA MIRASOL","PUERTO MONTT",7634,10101]
[7632,10101,"ESCUELA N 10 ANGELMO","PUERTO MONTT",7632,10101]
[7638,10101,"ESCUELA N 3 MELIPULLI","PUERTO MONTT",7638,10101]
[7636,10101,"ESCUELA N 5 MIRAMAR","PUERTO MONTT",7636,10101]
[7637,10101,"ESCUELA N 7 ARABE-SIRIA","PUERTO MONTT",7637,10101]
[7631,10101,"ESCUELA N°2 REPUBLICA ARGENTINA","PUERTO MONTT",7631,10101]
[20376,10101,"ESCUELA NUEVA ALERCE","PUERTO MONTT",20376,10101]
[22175,10101,"ESCUELA PABLO NERUDA","PUERTO MONTT",22175,10101]
[22419,10101,"ESCUELA PADRE ALBERTO HURTADO","PUERTO MONTT",22419,10101]
[7646,10101,"ESCUELA ROTARIO PEDRO AVELINO BRAVO","PUERTO MONTT",7646,10101]
[7691,10101,"ESCUELA RURAL ÀPUNTILLA TENGLO","PUERTO MONTT",7691,10101]
[7658,10101,"ESCUELA RURAL CORRENTOSO","PUERTO MONTT",7658,10101]
[7679,10101,"ESCUELA RURAL HUELMO","PUERTO MONTT",7679,10101]
[7665,10101,"ESCUELA RURAL LA CHAMIZA","PUERTO MONTT",7665,10101]
[7682,10101,"ESCUELA RURAL LA PALOMA","PUERTO MONTT",7682,10101]
[7685,10101,"ESCUELA RURAL LA VARA","PUERTO MONTT",7685,10101]
[7671,10101,"ESCUELA RURAL LAGUNITAS","PUERTO MONTT",7671,10101]
[7654,10101,"ESCUELA RURAL LENCA","PUERTO MONTT",7654,10101]
[7655,10101,"ESCUELA RURAL MAILLEN","PUERTO MONTT",7655,10101]
[7686,10101,"ESCUELA RURAL MAILLEN-PUQUELDON","PUERTO MONTT",7686,10101]
[7656,10101,"ESCUELA RURAL PELLUCO","PUERTO MONTT",7656,10101]
[7684,10101,"ESCUELA RURAL TEPUAL","PUERTO MONTT",7684,10101]
[7675,10101,"ESCUELA RURAL TRAPEN","PUERTO MONTT",7675,10101]
[22086,10101,"LICEO RURAL LAS QUEMAS","PUERTO MONTT",22086,10101]
[7651,10101,"LICEO RURAL PIEDRA AZUL","PUERTO MONTT",7651,10101]
[7476,10302,"ESCUELA ALBERTO HURTADO","PUERTO OCTAY",7476,10302]
[7477,10302,"ESCUELA RURAL ADMINISTRACION RUPANCO","PUERTO OCTAY",7477,10302]
[7478,10302,"ESCUELA RURAL LAS CASCADAS","PUERTO OCTAY",7478,10302]
[7496,10302,"ESCUELA RURAL NOCHACO","PUERTO OCTAY",7496,10302]
[22519,10109,"COLEGIO MIRADOR DEL LAGO","PUERTO VARAS",22519,10109]
[7724,10109,"COLEGIO NUEVA BRAUNAU","PUERTO VARAS",7724,10109]
[7722,10109,"COLEGIO ROSITA NOVARO DE NOVARO PUERTO VARAS","PUERTO VARAS",7722,10109]
[22101,10109,"ESCUELA DIFERENCIAL `ASPADEP`","PUERTO VARAS",22101,10109]
[7723,10109,"ESCUELA GRUPO ESCOLAR","PUERTO VARAS",7723,10109]
[7725,10109,"ESCUELA RURAL COLONIA RIO SUR","PUERTO VARAS",7725,10109]
[7740,10109,"ESCUELA RURAL EPSON DE ENSENADA","PUERTO VARAS",7740,10109]
[2601,6309,"ESCUELA MUNICIPAL DE NILAHUE CORNEJO","PUMANQUE",2601,6309]
[2599,6309,"ESCUELA MUNICIPAL DE PUMANQUE","PUMANQUE",2599,6309]
[897,4304,"ESCUELA BELGICA","PUNITAQUI",897,4304]
[946,4304,"ESCUELA TERESITA DE LOS ANDES","PUNITAQUI",946,4304]
[8437,12101,"ESC. CAPITAN ARTURO PRAT CHACON","PUNTA ARENAS",8437,12101]
[8452,12101,"ESCUELA DE PUERTO HARRIS","PUNTA ARENAS",8452,12101]
[8450,12101,"ESCUELA DELLAMIRA REBECA AGUILAR","PUNTA ARENAS",8450,12101]
[8435,12101,"ESCUELA DIECIOCHO DE SEPTIEMBRE","PUNTA ARENAS",8435,12101]
[8449,12101,"ESCUELA ELBA OJEDA GOMEZ","PUNTA ARENAS",8449,12101]
[8434,12101,"ESCUELA ESPANA","PUNTA ARENAS",8434,12101]
[8443,12101,"ESCUELA ESPECIAL ROTARIO PAUL HARRIS","PUNTA ARENAS",8443,12101]
[24302,12101,"ESCUELA GENERAL MANUEL BULNES P.","PUNTA ARENAS",24302,12101]
[8441,12101,"ESCUELA HERNANDO DE MAGALLANES","PUNTA ARENAS",8441,12101]
[8439,12101,"ESCUELA JUAN WILLIAMS","PUNTA ARENAS",8439,12101]
[8433,12101,"ESCUELA LIBERTADOR CAP GRAL BDO OHIGGINS","PUNTA ARENAS",8433,12101]
[24318,12101,"ESCUELA PADRE ALBERTO HURTADO CRUCHAGA","PUNTA ARENAS",24318,12101]
[24334,12101,"ESCUELA PARVULARIA JOSH KEE","PUNTA ARENAS",24334,12101]
[8442,12101,"ESCUELA PEDRO PABLO LEMAITRE","PUNTA ARENAS",8442,12101]
[8448,12101,"ESCUELA PEDRO SARMIENTO DE GAMBOA","PUNTA ARENAS",8448,12101]
[8436,12101,"ESCUELA PORTUGAL","PUNTA ARENAS",8436,12101]
[11687,12101,"ESCUELA REPUBLICA ARGENTINA","PUNTA ARENAS",11687,12101]
[8438,12101,"ESCUELA REPUBLICA DE CROACIA","PUNTA ARENAS",8438,12101]
[24313,12101,"ESCUELA VILLA LAS NIEVES","PUNTA ARENAS",24313,12101]
[24307,12101,"LICEO JUAN BAUTISTA CONTARDI","PUNTA ARENAS",24307,12101]
[8195,10206,"ESCUELA PUQUELDON","PUQUELDON",8195,10206]
[8202,10206,"ESCUELA RURAL DETIF","PUQUELDON",8202,10206]
[8205,10206,"ESCUELA RURAL ICHUAC","PUQUELDON",8205,10206]
[8201,10206,"ESCUELA RURAL LAS CAMPANAS","PUQUELDON",8201,10206]
[5525,9208,"ESC. BASICA CAUPOLICAN","PUREN",5525,9208]
[5510,9208,"ESCUELA ENZO FERRARI","PUREN",5510,9208]
[5508,9208,"ESCUELA PEDRO DE ONA","PUREN",5508,9208]
[22430,10303,"COLEGIO CRECER","PURRANQUE",22430,10303]
[7507,10303,"ESCUELA BERTOLDO HOFMANN KAHLER","PURRANQUE",7507,10303]
[7531,10303,"ESCUELA PURRANQUE","PURRANQUE",7531,10303]
[7510,10303,"ESCUELA RURAL LA PAZ","PURRANQUE",7510,10303]
[7535,10303,"ESCUELA RURAL NUEVA ISRAEL","PURRANQUE",7535,10303]
[7508,10303,"ESCUELA VILLA LO BURGOS","PURRANQUE",7508,10303]
[40009,5705,"CTRO.APOYO A LA EDUC.ESPEC.DE PUTAENDO","PUTAENDO",40009,5705]
[1312,5705,"ESC. BAS. GASTON ORMAZABAL CABRERA","PUTAENDO",1312,5705]
[1308,5705,"ESCUELA ALEJANDRINA CARVAJAL ASPEE","PUTAENDO",1308,5705]
[1313,5705,"ESCUELA CATAN DABIKE","PUTAENDO",1313,5705]
[1309,5705,"ESCUELA EDUARDO BECERRA BASCUNAN","PUTAENDO",1309,5705]
[1310,5705,"ESCUELA MARIA LEIVA DE IBANEZ","PUTAENDO",1310,5705]
[1304,5705,"ESCUELA PASO HISTORICO EL TARTARO","PUTAENDO",1304,5705]
[1305,5705,"ESCUELA RENACER","PUTAENDO",1305,5705]
[1307,5705,"ESCUELA SAN ALBERTO","PUTAENDO",1307,5705]
[1301,5705,"LICEO MANUEL MARIN","PUTAENDO",1301,5705]
[1302,5705,"LICEO REPUBLICA DE ESTADOS UNIDOS","PUTAENDO",1302,5705]
[78,15201,"LICEO GRANADEROS","PUTRE",78,15201]
[7448,10304,"ESCUELA ENTRE LAGOS","PUYEHUE",7448,10304]
[22070,10304,"ESCUELA PARVULARIA `RAYITO DE SOL`","PUYEHUE",22070,10304]
[7449,10304,"ESCUELA RURAL ARMANDO SCHEUCH EPPLE","PUYEHUE",7449,10304]
[7459,10304,"ESCUELA RURAL ESTACION NUEVO PORVENIR","PUYEHUE",7459,10304]
[7450,10304,"ESCUELA RURAL LOS PELLINES","PUYEHUE",7450,10304]
[7460,10304,"ESCUELA RURAL PILMAIQUEN","PUYEHUE",7460,10304]
[8236,10207,"ESCUELA CHILHUE","QUEILEN",8236,10207]
[8241,10207,"ESCUELA RURAL ALVARO VARGAS MIRANDA","QUEILEN",8241,10207]
[22130,10208,"ESCUELA ALLA-KINTUY","QUELLON",22130,10208]
[22380,10208,"ESCUELA BASICA SECTOR ORIENTE","QUELLON",22380,10208]
[8256,10208,"ESCUELA EDUCADORA EULOGIA BORQUEZ PEREZ","QUELLON",8256,10208]
[8264,10208,"ESCUELA RURAL ADELA GARCIA GARCIA","QUELLON",8264,10208]
[8289,10208,"ESCUELA RURAL ARTISTICA ALUMNO MARCELO GUENTEO SOLIS","QUELLON",8289,10208]
[8288,10208,"ESCUELA RURAL YALDAD","QUELLON",8288,10208]
[40383,10209,"ESCUELA BASICA MIL PAISAJES-QUEMCHI","QUEMCHI",40383,10209]
[8113,10209,"ESCUELA RURAL AQUELARRE","QUEMCHI",8113,10209]
[8126,10209,"ESCUELA RURAL AUCAR","QUEMCHI",8126,10209]
[8142,10209,"ESCUELA RURAL BORDEMAR VILLA MECHUQUE","QUEMCHI",8142,10209]
[8114,10209,"ESCUELA RURAL LLIUCO","QUEMCHI",8114,10209]
[8117,10209,"ESCUELA RURAL MONTEMAR","QUEMCHI",8117,10209]
[8121,10209,"ESCUELA RURAL SANTA ROSA","QUEMCHI",8121,10209]
[8135,10209,"ESCUELA RURAL TAC","QUEMCHI",8135,10209]
[4402,8308,"ESCUELA BASICA LONCOPANGUE","QUILACO",4402,8308]
[4392,8308,"INSTITUTO VALLE DEL SOL QUILACO","QUILACO",4392,8308]
[24520,13125,"ESC. BAS.MUNICIPAL MERCEDES FONTECILLA","QUILICURA",24520,13125]
[25788,13125,"ESCUELA BASICA ANA FRANK","QUILICURA",25788,13125]
[10241,13125,"ESCUELA BASICA EL MANIO","QUILICURA",10241,13125]
[25797,13125,"ESCUELA BÁSICA PUCARA LASANA","QUILICURA",25797,13125]
[10239,13125,"ESCUELA ESTADO DE MICHIGAN","QUILICURA",10239,13125]
[10240,13125,"ESCUELA LUIS CRUZ MARTINEZ","QUILICURA",10240,13125]
[25194,13125,"ESCUELA MUNICIPAL VALLE DE LUNA","QUILICURA",25194,13125]
[24999,13125,"ESCUELA PROFESORA MARIA LUISA SEPULVEDA","QUILICURA",24999,13125]
[4334,8309,"ESCUELA BASICA VILLA MERCEDES","QUILLECO",4334,8309]
[4331,8309,"LICEO FRANCISCO BASCUNAN GUERRERO","QUILLECO",4331,8309]
[4333,8309,"LICEO ISABEL RIQUELME","QUILLECO",4333,8309]
[4000,8413,"ESCUELA BÁSICA AMANDA CHÁVEZ NAVARRETE","QUILLON",4000,8413]
[4019,8413,"ESCUELA BÁSICA LAGUNA AVENDAÑO","QUILLON",4019,8413]
[4005,8413,"ESCUELA BÁSICA PUERTO LOS FRUTALES DE COYANCO","QUILLON",4005,8413]
[4002,8413,"ESCUELA BASICA EL CASINO","QUILLON",4002,8413]
[3999,8413,"ESCUELA BASICA HEROES DEL ITATA","QUILLON",3999,8413]
[4003,8413,"ESCUELA BASICA HUACAMALA","QUILLON",4003,8413]
[4006,8413,"ESCUELA BASICA LIUCURA BAJO","QUILLON",4006,8413]
[4016,8413,"ESCUELA BASICA PASO EL ROBLE","QUILLON",4016,8413]
[4001,8413,"ESCUELA PEDRO ENRIQUE TORRES SABELLE","QUILLON",4001,8413]
[1364,5501,"COLEGIO VALLE DE QUILLOTA","QUILLOTA",1364,5501]
[1378,5501,"ESCUELA BASICA ABEL GUERRERO AGUIRRE","QUILLOTA",1378,5501]
[1371,5501,"ESCUELA BASICA ARAUCO","QUILLOTA",1371,5501]
[1368,5501,"ESCUELA BASICA CANADA","QUILLOTA",1368,5501]
[1385,5501,"ESCUELA BASICA LA PALMA","QUILLOTA",1385,5501]
[1390,5501,"ESCUELA BASICA LAS PATAGUAS","QUILLOTA",1390,5501]
[1376,5501,"ESCUELA BASICA RAMON FREIRE","QUILLOTA",1376,5501]
[1370,5501,"ESCUELA BASICA REPUBLICA DE MEXICO","QUILLOTA",1370,5501]
[1389,5501,"ESCUELA CRISTINA DURAN","QUILLOTA",1389,5501]
[1374,5501,"ESCUELA ESPECIAL LOS PALTOS","QUILLOTA",1374,5501]
[1377,5501,"ESCUELA NUESTRO MUNDO","QUILLOTA",1377,5501]
[1885,5801,"COLEGIO CAPITAN IGNACIO CARRERA PINTO","QUILPUE",1885,5801]
[1889,5801,"COLEGIO FERNANDO DURAN VILLARREAL","QUILPUE",1889,5801]
[1890,5801,"COLEGIO JOSE MIGUEL INFANTE","QUILPUE",1890,5801]
[1888,5801,"ESC.CDTE. ELEUTERIO RAMIREZ MOLINA","QUILPUE",1888,5801]
[1893,5801,"ESCUELA BASICA DARIO SALAS","QUILPUE",1893,5801]
[1892,5801,"ESCUELA BASICA GASPAR CABRALES","QUILPUE",1892,5801]
[1891,5801,"ESCUELA BASICA JORGE ROCK LARA","QUILPUE",1891,5801]
[1887,5801,"ESCUELA GUARDIAMARINA GUILLERMO ZANARTU I.","QUILPUE",1887,5801]
[1900,5801,"ESCUELA LOS MOLLES DE MARGA MARGA","QUILPUE",1900,5801]
[1881,5801,"ESCUELA LUIS CRUZ MARTINEZ","QUILPUE",1881,5801]
[1886,5801,"ESCUELA MANUEL BULNES PRIETO","QUILPUE",1886,5801]
[1899,5801,"ESCUELA TENIENTE IGNACIO SERRANO MONTANER","QUILPUE",1899,5801]
[1898,5801,"ESCUELA THEODOR HEUSS","QUILPUE",1898,5801]
[14720,5801,"LICEO GASTRONOMIA Y TURISMO","QUILPUE",14720,5801]
[1895,5801,"LICEO TECNICO PROFESIONAL MANNHEIM","QUILPUE",1895,5801]
[8186,10210,"ESCUELA RURAL LOS PINOS","QUINCHAO",8186,10210]
[8181,10210,"ESCUELA RURAL METAHUE","QUINCHAO",8181,10210]
[8191,10210,"ESCUELA RURAL SAN FRANCISCO","QUINCHAO",8191,10210]
[8189,10210,"ESCUELA RURAL TERESA CARDENAS DE PAREDES","QUINCHAO",8189,10210]
[8174,10210,"LICEO INSULAR","QUINCHAO",8174,10210]
[2325,6114,"COLEGIO RA┌L RAMÍREZ MAYOL","QUINTA DE TILCOCO",2325,6114]
[2321,6114,"ESCUELA AMPARO RAYO HORTA","QUINTA DE TILCOCO",2321,6114]
[2324,6114,"ESCUELA JAIME FELDMAN MILLER","QUINTA DE TILCOCO",2324,6114]
[2319,6114,"LICEO REPUBLICA DE ITALIA","QUINTA DE TILCOCO",2319,6114]
[2320,6114,"VIOLETA FUENTES CARVAJAL","QUINTA DE TILCOCO",2320,6114]
[9991,13126,"ESCUELA ABATE MOLINA","QUINTA NORMAL",9991,13126]
[9994,13126,"ESCUELA ANGELMO","QUINTA NORMAL",9994,13126]
[9999,13126,"ESCUELA ANTUMALAL","QUINTA NORMAL",9999,13126]
[10005,13126,"ESCUELA BASICA MUNICIPAL GRENOBLE","QUINTA NORMAL",10005,13126]
[8564,13126,"ESCUELA BASICA REINO DE NORUEGA","QUINTA NORMAL",8564,13126]
[10000,13126,"ESCUELA CALICANTO","QUINTA NORMAL",10000,13126]
[9992,13126,"ESCUELA DIEGO PORTALES","QUINTA NORMAL",9992,13126]
[9996,13126,"ESCUELA ESPANA","QUINTA NORMAL",9996,13126]
[10012,13126,"ESCUELA GIL DE CASTRO","QUINTA NORMAL",10012,13126]
[9993,13126,"ESCUELA INGLATERRA","QUINTA NORMAL",9993,13126]
[9995,13126,"ESCUELA INSIGNE GABRIELA","QUINTA NORMAL",9995,13126]
[9998,13126,"ESCUELA LO FRANCO","QUINTA NORMAL",9998,13126]
[10001,13126,"ESCUELA MEMBRILLAR","QUINTA NORMAL",10001,13126]
[9987,13126,"ESCUELA PLATON","QUINTA NORMAL",9987,13126]
[10006,13126,"ESCUELA REPUBLICA DE LA INDIA","QUINTA NORMAL",10006,13126]
[1853,5107,"COLEGIO COSTA MAUCO","QUINTERO",1853,5107]
[14213,5107,"COLEGIO VALLE DE NARAU","QUINTERO",14213,5107]
[1855,5107,"ESCUELA BASICA REPUBLICA DE FRANCIA","QUINTERO",1855,5107]
[1857,5107,"ESCUELA JUAN JOSE TORTEL","QUINTERO",1857,5107]
[1856,5107,"ESCUELA MANTAGUA","QUINTERO",1856,5107]
[17930,8414,"ESCUELA EL LLANO","QUIRIHUE",17930,8414]
[4103,8414,"ESCUELA GRUMETE CORTES","QUIRIHUE",4103,8414]
[4104,8414,"ESCUELA NUEVA AMERICA","QUIRIHUE",4104,8414]
[2126,6101,"COL. JOSE A. MANSO DE VELASCO Y S.","RANCAGUA",2126,6101]
[2129,6101,"COLEGIO AURORA DE CHILE","RANCAGUA",2129,6101]
[15753,6101,"COLEGIO BENJAMIN VICUÑA MACKENNA","RANCAGUA",15753,6101]
[2118,6101,"COLEGIO ESPANA","RANCAGUA",2118,6101]
[2146,6101,"COLEGIO MANUEL ROJAS","RANCAGUA",2146,6101]
[2116,6101,"COLEGIO MUNICIPAL EDUARDO DE GEYTER","RANCAGUA",2116,6101]
[2125,6101,"COLEGIO PABLO GARRIDO","RANCAGUA",2125,6101]
[15768,6101,"COLEGIO SANTA FILOMENA","RANCAGUA",15768,6101]
[15503,6101,"ESCUELA DUENDE MELODIA","RANCAGUA",15503,6101]
[2138,6101,"ESCUELA MUNICIPAL ALBERTO BLEST GANA","RANCAGUA",2138,6101]
[2140,6101,"ESCUELA MUNICIPAL AUGUSTO D HALMAR","RANCAGUA",2140,6101]
[2131,6101,"ESCUELA MUNICIPAL CARLOS MIRANDA MIRANDA","RANCAGUA",2131,6101]
[2122,6101,"ESCUELA MUNICIPAL EL COBRE","RANCAGUA",2122,6101]
[2143,6101,"ESCUELA MUNICIPAL HERMANOS CARRERA","RANCAGUA",2143,6101]
[2136,6101,"ESCUELA MUNICIPAL ISABEL RIQUELME","RANCAGUA",2136,6101]
[2147,6101,"ESCUELA MUNICIPAL J.M. BALMACEDA","RANCAGUA",2147,6101]
[2135,6101,"ESCUELA MUNICIPAL JEAN PIAGET","RANCAGUA",2135,6101]
[2119,6101,"ESCUELA MUNICIPAL MANUEL RODRIGUEZ","RANCAGUA",2119,6101]
[2114,6101,"ESCUELA MUNICIPAL MARCELA PAZ","RANCAGUA",2114,6101]
[2145,6101,"ESCUELA MUNICIPAL MARTA BRUNET","RANCAGUA",2145,6101]
[2120,6101,"ESCUELA MUNICIPAL MINERAL EL TENIENTE","RANCAGUA",2120,6101]
[2132,6101,"ESCUELA MUNICIPAL PATRICIO MEKIS","RANCAGUA",2132,6101]
[2115,6101,"ESCUELA MUNICIPAL RENE SCHNEIDER CHEREAU","RANCAGUA",2115,6101]
[2139,6101,"ESCUELA MUNICIPAL VIRGINIA BRAVO","RANCAGUA",2139,6101]
[2124,6101,"LICEO INTEGRADO LIBERTADOR SIMÓN BOLIVAR","RANCAGUA",2124,6101]
[4061,8415,"ESCUELA BASICA AMERICA","RANQUIL",4061,8415]
[20427,8415,"ESCUELA BASICA ÑIPAS","RANQUIL",20427,8415]
[4026,8415,"ESCUELA BASICA NUEVA ALDEA","RANQUIL",4026,8415]
[4029,8415,"ESCUELA BASICA SAN IGNACIO DE PALOMARES","RANQUIL",4029,8415]
[2927,7305,"ESCUELA EL PLUMERO","RAUCO",2927,7305]
[2918,7305,"ESCUELA LOS ALMENDROS","RAUCO",2918,7305]
[2920,7305,"ESCUELA LUIS LEYTON RUBIO","RAUCO",2920,7305]
[2917,7305,"ESCUELA RAUCO","RAUCO",2917,7305]
[10270,13127,"CENTRO EDUC.ESCRITORES DE CHILE","RECOLETA",10270,13127]
[8546,13127,"ESC.BAS.BILINGUE REPUBLICA DEL PARAGUAY","RECOLETA",8546,13127]
[10302,13127,"ESCUELA ANNE ELEONOR ROOSEVELT","RECOLETA",10302,13127]
[10267,13127,"ESCUELA ESCRITORA MARCELA PAZ","RECOLETA",10267,13127]
[10262,13127,"ESCUELA ESPANA","RECOLETA",10262,13127]
[10268,13127,"ESCUELA PUERTO RICO","RECOLETA",10268,13127]
[10307,13127,"ESCUELA RAFAEL VALDIVIESO","RECOLETA",10307,13127]
[10257,13127,"ESCUELA SARGENTO 2. DANIEL REBOLLEDO","RECOLETA",10257,13127]
[10291,13127,"ESCUELA VICTOR CUCCUINI","RECOLETA",10291,13127]
[10252,13127,"LICEO ARTURO PEREZ CANTO","RECOLETA",10252,13127]
[5272,9209,"ESCUELA BASICA LOS NOGALES","RENAICO",5272,9209]
[5273,9209,"ESCUELA MUNICIP. LA NOBEL GABRIELA","RENAICO",5273,9209]
[5270,9209,"LICEO POLITECNICO DOMINGO STA MARIA","RENAICO",5270,9209]
[10216,13128,"ESC. BASICA MONSERRAT ROBERT DE GARCIA","RENCA",10216,13128]
[12273,13128,"ESC.MUNIC.DE PARVULOS HERNAN DEL SOL","RENCA",12273,13128]
[10200,13128,"ESCUELA BASICA ISABEL LE BRUN","RENCA",10200,13128]
[12113,13128,"ESCUELA BASICA LO VELASQUEZ","RENCA",12113,13128]
[10204,13128,"ESCUELA CAPITAN JOSE LUIS ARANEDA","RENCA",10204,13128]
[10202,13128,"ESCUELA DOMINGO SANTA MARIA GONZALEZ","RENCA",10202,13128]
[10210,13128,"ESCUELA GENERAL ALEJANDRO GOROSTIAGA O","RENCA",10210,13128]
[10205,13128,"ESCUELA GENERAL MANUEL BULNES PRIETO","RENCA",10205,13128]
[10212,13128,"ESCUELA JUANA ATALA DE HIRMAS","RENCA",10212,13128]
[10197,13128,"ESCUELA JUANA DE LESTONAC","RENCA",10197,13128]
[10207,13128,"ESCUELA REBECA MATTE BELLO","RENCA",10207,13128]
[10201,13128,"LICEO THOMAS ALVA EDISON","RENCA",10201,13128]
[2285,6115,"COLEGIO MANUEL FRANCISCO CORREA","RENGO",2285,6115]
[2301,6115,"COLEGIO MUNICIPAL DE APALTA","RENGO",2301,6115]
[2299,6115,"COLEGIO MUNICIPAL EL CERRILLO","RENGO",2299,6115]
[2294,6115,"COLEGIO MUNICIPAL LA ESMERALDA","RENGO",2294,6115]
[2296,6115,"COLEGIO MUNICIPAL LO CARTAGENA","RENGO",2296,6115]
[2282,6115,"COLEGIO MUNICIPAL LO DE LOBO","RENGO",2282,6115]
[2293,6115,"COLEGIO MUNICIPAL LOS CHOAPINOS","RENGO",2293,6115]
[2286,6115,"COLEGIO MUNICIPAL LUIS GALDAMES","RENGO",2286,6115]
[2304,6115,"COLEGIO MUNICIPAL VILLA DEL COBIL","RENGO",2304,6115]
[2302,6115,"ESCUELA BASICA VICTOR NICOLETTI TAMANINI","RENGO",2302,6115]
[2288,6115,"ESCUELA CARLOS CONDELL DE LA HAZA","RENGO",2288,6115]
[2291,6115,"ESCUELA DIFERENCIAL TERESA NARETTO DE NICOLETTI","RENGO",2291,6115]
[15614,6115,"ESCUELA EL NARANJAL","RENGO",15614,6115]
[15724,6115,"ESCUELA FERNANDA AEDO FAUNDEZ","RENGO",15724,6115]
[2297,6115,"ESCUELA GUSTAVO BISQUERTT S.","RENGO",2297,6115]
[2300,6115,"ESCUELA LA ISLA EMMA ESCOBAR DE LAGOS","RENGO",2300,6115]
[2284,6115,"ESCUELA LA PAZ","RENGO",2284,6115]
[2307,6115,"ESCUELA MARTA AVARIA SALVATIERRA","RENGO",2307,6115]
[2289,6115,"ESCUELA REPUBLICA DE ALEMANIA","RENGO",2289,6115]
[15535,6115,"ESCUELA SANTA TERESA DE AVILA","RENGO",15535,6115]
[2292,6115,"ESCUELA VICENTE HUIDOBRO","RENGO",2292,6115]
[11245,6116,"COL.EDUC. ESPECIAL DR. ALBERT SCHWEITZER","REQUINOA",11245,6116]
[2267,6116,"ESC. REPUBLICA DE FRANCIA","REQUINOA",2267,6116]
[2266,6116,"ESCUELA BASICA CAMPO LINDO","REQUINOA",2266,6116]
[2265,6116,"ESCUELA BERTA SAAVEDRA SEGURA","REQUINOA",2265,6116]
[2279,6116,"ESCUELA CANADA","REQUINOA",2279,6116]
[2275,6116,"ESCUELA DAVID DEL CURTO","REQUINOA",2275,6116]
[2268,6116,"ESCUELA MUNICIPAL SANTA AMALIA","REQUINOA",2268,6116]
[40025,6116,"LICEO REQUINOA","REQUINOA",40025,6116]
[3442,7405,"COLEGIO AJIAL","RETIRO",3442,7405]
[3443,7405,"COLEGIO ROBINSON CABRERA BELTRAN","RETIRO",3443,7405]
[3436,7405,"ESCUELA COPIHUE","RETIRO",3436,7405]
[3454,7405,"ESCUELA LOS ROBLES","RETIRO",3454,7405]
[3435,7405,"ESCUELA MANUEL MONTT","RETIRO",3435,7405]
[3445,7405,"ESCUELA ROMERAL","RETIRO",3445,7405]
[3453,7405,"ESCUELA SANTA CECILIA","RETIRO",3453,7405]
[3450,7405,"ESCUELA SANTA DELFINA","RETIRO",3450,7405]
[3448,7405,"ESCUELA SANTA ISABEL","RETIRO",3448,7405]
[1258,5303,"ESCUELA BASICA EMIGDIO GALDAMES ROBLES","RINCONADA",1258,5303]
[1259,5303,"ESCUELA BASICA MANUEL LEON SALINAS","RINCONADA",1259,5303]
[1257,5303,"ESCUELA PERFECTO DE LA FUENTE DEL VILLAR","RINCONADA",1257,5303]
[7238,14204,"ESCUELA BASICA PATRICIO LYNCH","RIO BUENO",7238,14204]
[7237,14204,"ESCUELA BASICA RIO BUENO","RIO BUENO",7237,14204]
[22414,14204,"ESCUELA PAMPA RIOS","RIO BUENO",22414,14204]
[7243,14204,"ESCUELA RURAL CARIMALLIN BAJO","RIO BUENO",7243,14204]
[7244,14204,"ESCUELA RURAL COLONIA DIUMEN","RIO BUENO",7244,14204]
[7240,14204,"ESCUELA RURAL CRUCERO","RIO BUENO",7240,14204]
[7273,14204,"ESCUELA RURAL EL ARRAYAN","RIO BUENO",7273,14204]
[7252,14204,"ESCUELA RURAL MANTILHUE ALTO","RIO BUENO",7252,14204]
[7266,14204,"ESCUELA RURAL TRAPI","RIO BUENO",7266,14204]
[7250,14204,"ESCUELA RURAL VALLE MANTILHUE BAJO","RIO BUENO",7250,14204]
[7242,14204,"ESCUELA RURAL VIVANCO","RIO BUENO",7242,14204]
[3034,7108,"ESCUELA BASICA JUAN LUIS SANFUENTES ANDONAEGUI","RIO CLARO",3034,7108]
[3039,7108,"ESCUELA ODESSA","RIO CLARO",3039,7108]
[3037,7108,"ESCUELA PORVENIR","RIO CLARO",3037,7108]
[3033,7108,"LICEO AGROINDUSTRIAL RIO CLARO","RIO CLARO",3033,7108]
[774,4305,"COLEGIO PICHASCA","RIO HURTADO",774,4305]
[793,4305,"ESCUELA BASICA DE SERON","RIO HURTADO",793,4305]
[773,4305,"ESCUELA SAMO ALTO","RIO HURTADO",773,4305]
[8404,11402,"ESCUELA AONIKENK","RIO IBAÑEZ",8404,11402]
[7544,10305,"COLEGIO RIACHUELO","RIO NEGRO",7544,10305]
[7541,10305,"ESCUELA ANDREW JACKSON","RIO NEGRO",7541,10305]
[7543,10305,"ESCUELA RIO NEGRO","RIO NEGRO",7543,10305]
[8467,12103,"BERNARDO DE BRUYNE","RIO VERDE",8467,12103]
[2825,7306,"ESCUELA AMERICA LATINA","ROMERAL",2825,7306]
[2822,7306,"ESCUELA ARTURO ALESSANDRI PALMA","ROMERAL",2822,7306]
[2830,7306,"ESCUELA CARLOS LAZCANO ALFONSO","ROMERAL",2830,7306]
[2832,7306,"ESCUELA FRANCISCO DE PAULA SANTANDER","ROMERAL",2832,7306]
[2831,7306,"ESCUELA GERARDO RODRIGUEZ ORTUZAR","ROMERAL",2831,7306]
[2827,7306,"ESCUELA GUAICO CENTRO","ROMERAL",2827,7306]
[2823,7306,"ESCUELA RAMON FREIRE","ROMERAL",2823,7306]
[2826,7306,"ESCUELA TRES ESQUINAS","ROMERAL",2826,7306]
[6459,9116,"ESC. BASICA ANTONIO LADINO","SAAVEDRA",6459,9116]
[6457,9116,"ESC. BASICA AUGUSTO WINTER TAPIA","SAAVEDRA",6457,9116]
[6455,9116,"ESCUELA BASICA BARTOLO LLANCALEO","SAAVEDRA",6455,9116]
[6454,9116,"ESCUELA BASICA COLLICO RANCO","SAAVEDRA",6454,9116]
[6495,9116,"ESCUELA RUCA RAQUI","SAAVEDRA",6495,9116]
[6452,9116,"LICEO REINO DE SUECIA","SAAVEDRA",6452,9116]
[2867,7307,"ESC.DE EDUC.GRAL. BASICA MONSENOR ENRIQUE COR","SAGRADA FAMILIA",2867,7307]
[2876,7307,"ESCUELA EUGENIO TAGLE VALDES","SAGRADA FAMILIA",2876,7307]
[2873,7307,"ESCUELA JOSE CANEPA VACCAREZZA","SAGRADA FAMILIA",2873,7307]
[2870,7307,"ESCUELA LA ISLA","SAGRADA FAMILIA",2870,7307]
[2871,7307,"ESCUELA LO VALDIVIA","SAGRADA FAMILIA",2871,7307]
[2868,7307,"ESCUELA SANTA ROSA","SAGRADA FAMILIA",2868,7307]
[2866,7307,"ESCUELA VILLA PRAT","SAGRADA FAMILIA",2866,7307]
[1017,4204,"ESCUELA BASICA BERTA HIDALGO BARAHONA","SALAMANCA",1017,4204]
[1019,4204,"ESCUELA BASICA CHILLEPIN","SALAMANCA",1019,4204]
[1015,4204,"ESCUELA BASICA DIAGUITAS DE CHALINGA","SALAMANCA",1015,4204]
[1020,4204,"ESCUELA BASICA GUISELA GAMBOA SALINAS","SALAMANCA",1020,4204]
[1031,4204,"ESCUELA BASICA JULIO ECHAVARRIA","SALAMANCA",1031,4204]
[1033,4204,"ESCUELA BASICA PANGUESILLO","SALAMANCA",1033,4204]
[1022,4204,"ESCUELA COIRON","SALAMANCA",1022,4204]
[1018,4204,"ESCUELA EL TAMBO","SALAMANCA",1018,4204]
[1014,4204,"ESCUELA MATILDE SALAMANCA","SALAMANCA",1014,4204]
[1016,4204,"ESCUELA TRANQUILLA","SALAMANCA",1016,4204]
[2019,5601,"COLEGIO ESPANA","SAN ANTONIO",2019,5601]
[2037,5601,"EDUARDO FERNANDEZ DE ASTURIAS","SAN ANTONIO",2037,5601]
[2026,5601,"ESCUELA BASICA CERRO PLACILLA","SAN ANTONIO",2026,5601]
[2035,5601,"ESCUELA BASICA CUNCUMEN","SAN ANTONIO",2035,5601]
[2038,5601,"ESCUELA BASICA EL ASILO","SAN ANTONIO",2038,5601]
[2036,5601,"ESCUELA BASICA LEYDA","SAN ANTONIO",2036,5601]
[2022,5601,"ESCUELA BASICA SAN JOSE DE CALASANZ","SAN ANTONIO",2022,5601]
[2023,5601,"ESCUELA CRISTO DEL MAIPO","SAN ANTONIO",2023,5601]
[2018,5601,"ESCUELA MOVILIZADORES PORTUARIOS","SAN ANTONIO",2018,5601]
[2027,5601,"ESCUELA POETA HUIDOBRO","SAN ANTONIO",2027,5601]
[2014,5601,"ESCUELA POETA PABLO NERUDA","SAN ANTONIO",2014,5601]
[2025,5601,"ESCUELA PRE-BASICA PETER PAN","SAN ANTONIO",2025,5601]
[2020,5601,"ESCUELA PRESIDENTE PEDRO AGUIRRE CERDA","SAN ANTONIO",2020,5601]
[2017,5601,"ESCUELA VILLA LAS DUNAS","SAN ANTONIO",2017,5601]
[2021,5601,"PADRE ANDRE COINDRE","SAN ANTONIO",2021,5601]
[2024,5601,"PROFESOR PEDRO VIVEROS ORMENO","SAN ANTONIO",2024,5601]
[25960,13401,"CENTRO EDUC. PADRE ALBERTO HURTADO DE SAN BER","SAN BERNARDO",25960,13401]
[10542,13401,"CENTRO EDUCACIONAL BALDOMERO LILLO","SAN BERNARDO",10542,13401]
[25698,13401,"COLEGIO JAIME GUZMÁN ERRAZURIZ","SAN BERNARDO",25698,13401]
[10580,13401,"ESCUELA ABRAHAM LINCOLN","SAN BERNARDO",10580,13401]
[10556,13401,"ESCUELA ALEMANIA","SAN BERNARDO",10556,13401]
[10581,13401,"ESCUELA BASICA ANTUPILLAN","SAN BERNARDO",10581,13401]
[24654,13401,"ESCUELA BASICA CINCO PINOS","SAN BERNARDO",24654,13401]
[10570,13401,"ESCUELA BASICA DR LUIS SEPULVEDA SALVATI","SAN BERNARDO",10570,13401]
[10588,13401,"ESCUELA CARDENAL ANTONIO SAMORE","SAN BERNARDO",10588,13401]
[10577,13401,"ESCUELA DE EDUCACION DIFERENCIAL","SAN BERNARDO",10577,13401]
[10565,13401,"ESCUELA DIEGO PORTALES","SAN BERNARDO",10565,13401]
[10586,13401,"ESCUELA ELEODORO YANEZ PONCE DE LEON","SAN BERNARDO",10586,13401]
[10571,13401,"ESCUELA ESCRITORA MARCELA PAZ","SAN BERNARDO",10571,13401]
[10574,13401,"ESCUELA ESPANA","SAN BERNARDO",10574,13401]
[10554,13401,"ESCUELA GENERAL RENE SCHNEIDER CHEREAU","SAN BERNARDO",10554,13401]
[10589,13401,"ESCUELA HARAS LOS CONDORES","SAN BERNARDO",10589,13401]
[10548,13401,"ESCUELA ISABEL RIQUELME","SAN BERNARDO",10548,13401]
[10560,13401,"ESCUELA JAVIERA CARRERA VERDUGO","SAN BERNARDO",10560,13401]
[10579,13401,"ESCUELA JOSE NUEZ MARTIN","SAN BERNARDO",10579,13401]
[10550,13401,"ESCUELA L.GRAL. BERNARDO O┤HIGGINS","SAN BERNARDO",10550,13401]
[10567,13401,"ESCUELA MAHUIDA","SAN BERNARDO",10567,13401]
[10563,13401,"ESCUELA MANUEL MAGALLANES MOURE","SAN BERNARDO",10563,13401]
[25078,13401,"ESCUELA PART.COMANDANTE CARLOS CONDELL","SAN BERNARDO",25078,13401]
[10558,13401,"ESCUELA REPUBLICA DE LOS EE.UU. DE AMERICA","SAN BERNARDO",10558,13401]
[10547,13401,"ESCUELA REPUBLICA DEL BRASIL","SAN BERNARDO",10547,13401]
[10564,13401,"ESCUELA REPUBLICA DEL PERU","SAN BERNARDO",10564,13401]
[10578,13401,"ESCUELA STA. TERESA DE LOS MORROS","SAN BERNARDO",10578,13401]
[12079,13401,"HERNAN MERINO CORREA","SAN BERNARDO",12079,13401]
[10592,13401,"LICEO CLARA SOLOVERA","SAN BERNARDO",10592,13401]
[10569,13401,"LICEO NUEVO PORVENIR","SAN BERNARDO",10569,13401]
[25009,13401,"LICEO VALLE DE LLUTA","SAN BERNARDO",25009,13401]
[3757,8416,"ESCUELA AGUA BUENA","SAN CARLOS",3757,8416]
[3754,8416,"ESCUELA BULI","SAN CARLOS",3754,8416]
[3759,8416,"ESCUELA CACHAPOAL","SAN CARLOS",3759,8416]
[3758,8416,"ESCUELA EL CARBON","SAN CARLOS",3758,8416]
[3786,8416,"ESCUELA EL SAUCE","SAN CARLOS",3786,8416]
[3748,8416,"ESCUELA ESPECIAL RENACER","SAN CARLOS",3748,8416]
[3740,8416,"ESCUELA GENERAL DOMINGO URRUTIA","SAN CARLOS",3740,8416]
[3744,8416,"ESCUELA GENERAL JOSÉ MIGUEL CARRERA VERDUGO","SAN CARLOS",3744,8416]
[3745,8416,"ESCUELA GENERAL SOFANOR PARRA HERMOSILLA","SAN CARLOS",3745,8416]
[3749,8416,"ESCUELA JOAQUIN DEL PINO ROZAS Y NEGRETE","SAN CARLOS",3749,8416]
[3784,8416,"ESCUELA JUNQUILLO","SAN CARLOS",3784,8416]
[3768,8416,"ESCUELA LAS ARBOLEDAS","SAN CARLOS",3768,8416]
[3782,8416,"ESCUELA MANUEL ANTONIO CASTILLO VELASCO","SAN CARLOS",3782,8416]
[3781,8416,"ESCUELA MILLAUQUEN","SAN CARLOS",3781,8416]
[3762,8416,"ESCUELA MONTE BLANCO","SAN CARLOS",3762,8416]
[3755,8416,"ESCUELA NINQUIHUE","SAN CARLOS",3755,8416]
[3760,8416,"ESCUELA RIBERA DE NUBLE","SAN CARLOS",3760,8416]
[3785,8416,"ESCUELA TRES ESQUINAS","SAN CARLOS",3785,8416]
[3743,8416,"LICEO DIEGO PORTALES PALAZUELOS","SAN CARLOS",3743,8416]
[18017,8416,"LICEO TÉCNICO PROFESIONAL VIOLETA PARRA SANDOVAL","SAN CARLOS",18017,8416]
[3058,7109,"ESCUELA AURORA","SAN CLEMENTE",3058,7109]
[3073,7109,"ESCUELA BAJO LIRCAY","SAN CLEMENTE",3073,7109]
[3081,7109,"ESCUELA BAJO PERQUIN","SAN CLEMENTE",3081,7109]
[3068,7109,"ESCUELA BELLA UNION","SAN CLEMENTE",3068,7109]
[3076,7109,"ESCUELA BRAMADERO","SAN CLEMENTE",3076,7109]
[3070,7109,"ESCUELA CHEQUEN DE LA PENA","SAN CLEMENTE",3070,7109]
[3063,7109,"ESCUELA CORRALONES","SAN CLEMENTE",3063,7109]
[11347,7109,"ESCUELA DE PARVULOS SAN CLEMENTE","SAN CLEMENTE",11347,7109]
[3059,7109,"ESCUELA DEIDAMIA PAREDES BELLO","SAN CLEMENTE",3059,7109]
[3090,7109,"ESCUELA EL COLORADO","SAN CLEMENTE",3090,7109]
[3065,7109,"ESCUELA ENRIQUE CORREA GUZMAN","SAN CLEMENTE",3065,7109]
[3106,7109,"ESCUELA FLOR DEL LLANO","SAN CLEMENTE",3106,7109]
[3096,7109,"ESCUELA LOS ALMENDROS","SAN CLEMENTE",3096,7109]
[3086,7109,"ESCUELA LOS MONTES","SAN CLEMENTE",3086,7109]
[3062,7109,"ESCUELA PEUMO NEGRO","SAN CLEMENTE",3062,7109]
[3061,7109,"ESCUELA PUNTA DE DIAMANTE","SAN CLEMENTE",3061,7109]
[3069,7109,"ESCUELA QUERI","SAN CLEMENTE",3069,7109]
[3060,7109,"ESCUELA RAMADILLAS","SAN CLEMENTE",3060,7109]
[3107,7109,"ESCUELA SANTA ELENA","SAN CLEMENTE",3107,7109]
[1234,5304,"ESC. BASICA SILVIO ZENTENO VERGARA","SAN ESTEBAN",1234,5304]
[1246,5304,"ESCUELA BÁSICA LIBERTAD","SAN ESTEBAN",1246,5304]
[1243,5304,"ESCUELA EL COBRE","SAN ESTEBAN",1243,5304]
[1245,5304,"ESCUELA EL CORAZON","SAN ESTEBAN",1245,5304]
[1238,5304,"ESCUELA INCLUSIVA SAN LORENZO","SAN ESTEBAN",1238,5304]
[1235,5304,"ESCUELA LO CALVO","SAN ESTEBAN",1235,5304]
[1233,5304,"ESCUELA PABLO NERUDA","SAN ESTEBAN",1233,5304]
[1240,5304,"ESCUELA RIO COLORADO","SAN ESTEBAN",1240,5304]
[3831,8417,"ESCUELA BASICA PASO ANCHO","SAN FABIAN",3831,8417]
[3823,8417,"LICEO JORGE ALESSANDRI RODRIGUEZ","SAN FABIAN",3823,8417]
[1280,5701,"ESCUELA 21 DE MAYO","SAN FELIPE",1280,5701]
[1274,5701,"ESCUELA ALMENDRAL","SAN FELIPE",1274,5701]
[1265,5701,"ESCUELA BASICA BERNARDO O HIGGINS R.","SAN FELIPE",1265,5701]
[1286,5701,"ESCUELA BASICA CAROLINA OCAMPO GARCIA","SAN FELIPE",1286,5701]
[1268,5701,"ESCUELA BASICA JOSE DE SAN MARTIN","SAN FELIPE",1268,5701]
[1282,5701,"ESCUELA BUCALEMITO","SAN FELIPE",1282,5701]
[1275,5701,"ESCUELA BUEN PASTOR","SAN FELIPE",1275,5701]
[1279,5701,"ESCUELA CARMELA CARVAJAL DE PRAT","SAN FELIPE",1279,5701]
[1276,5701,"ESCUELA ESPECIAL SAGRADO CORAZON","SAN FELIPE",1276,5701]
[1283,5701,"ESCUELA HERIBERTO BERMUDEZ CRUZ","SAN FELIPE",1283,5701]
[1269,5701,"ESCUELA JOHN F KENNEDY","SAN FELIPE",1269,5701]
[1271,5701,"ESCUELA JOSÉ ANTONIO MANSO DE VELASCO","SAN FELIPE",1271,5701]
[1287,5701,"ESCUELA JOSE BERNARDO SUAREZ","SAN FELIPE",1287,5701]
[1212,5701,"ESCUELA JUAN GOMEZ MILLAS","SAN FELIPE",1212,5701]
[1266,5701,"ESCUELA MANUEL RODRIGUEZ ERDOIZA","SAN FELIPE",1266,5701]
[1285,5701,"ESCUELA MATEO COKLJAT K","SAN FELIPE",1285,5701]
[1281,5701,"ESCUELA REPUBLICA ARGENTINA","SAN FELIPE",1281,5701]
[1273,5701,"ESCUELA SAN RAFAEL","SAN FELIPE",1273,5701]
[14697,5701,"LICEO BICENTENARIO CORDILLERA DE SAN FELIPE","SAN FELIPE",14697,5701]
[1263,5701,"LICEO DE NINAS CORINA URBINA","SAN FELIPE",1263,5701]
[1264,5701,"LICEO SAN FELIPE","SAN FELIPE",1264,5701]
[2459,6301,"COLEGIO GIUSEPPE BERTOLUZZI DE FELIP","SAN FERNANDO",2459,6301]
[2463,6301,"COLEGIO HERMANO FERNANDO DE LA FUENTE","SAN FERNANDO",2463,6301]
[2469,6301,"ESCUELA ABRAHAM LINCOLN DE AGUA BUENA","SAN FERNANDO",2469,6301]
[2467,6301,"ESCUELA BAS.ABEL BOUCHON FAURE","SAN FERNANDO",2467,6301]
[2470,6301,"ESCUELA BAS.SAN JOSE DE LOS LINGUES","SAN FERNANDO",2470,6301]
[2472,6301,"ESCUELA BASICA ANTONIO LARA MEDINA","SAN FERNANDO",2472,6301]
[2476,6301,"ESCUELA BASICA GASPAR MARIN","SAN FERNANDO",2476,6301]
[2457,6301,"ESCUELA BASICA ISABEL LA CATOLICA","SAN FERNANDO",2457,6301]
[2471,6301,"ESCUELA BERNARDO MORENO FREDES","SAN FERNANDO",2471,6301]
[2465,6301,"ESCUELA CONCENTRAC. RURAL SERGIO VERDUGO HERRERA","SAN FERNANDO",2465,6301]
[2458,6301,"ESCUELA JORGE MUNOZ SILVA","SAN FERNANDO",2458,6301]
[2464,6301,"ESCUELA JOSE DE SAN MARTIN","SAN FERNANDO",2464,6301]
[2460,6301,"ESCUELA MARIA LUISA BOUCHON","SAN FERNANDO",2460,6301]
[2456,6301,"ESCUELA OLEGARIO LAZO BAEZA","SAN FERNANDO",2456,6301]
[15608,6301,"ESCUELA SAN HERNAN","SAN FERNANDO",15608,6301]
[2461,6301,"ESCUELA VILLA CENTINELA","SAN FERNANDO",2461,6301]
[2462,6301,"ESCUELA WASHINGTON OMAR VENEGAS","SAN FERNANDO",2462,6301]
[8470,12104,"ESCUELA PUNTA DELGADA","SAN GREGORIO",8470,12104]
[3888,8418,"COLEGIO POLITECNICO VICTOR JARA","SAN IGNACIO",3888,8418]
[18016,8418,"ESCUELA BASICA PUEBLO SECO","SAN IGNACIO",18016,8418]
[3897,8418,"ESCUELA CALLE ALEGRE","SAN IGNACIO",3897,8418]
[3899,8418,"ESCUELA COLTON VARIANTE","SAN IGNACIO",3899,8418]
[3891,8418,"ESCUELA LAS QUILAS","SAN IGNACIO",3891,8418]
[3890,8418,"ESCUELA MARÍA LUISA ESPINOZA RUIZ","SAN IGNACIO",3890,8418]
[3903,8418,"ESCUELA MAYULERMO","SAN IGNACIO",3903,8418]
[3906,8418,"ESCUELA SELVA NEGRA","SAN IGNACIO",3906,8418]
[3886,8418,"LICEO MANUEL JESUS ORTIZ","SAN IGNACIO",3886,8418]
[3492,7406,"ESCUELA BERNARDO OHIGGINS","SAN JAVIER",3492,7406]
[3483,7406,"ESCUELA GERONIMO LAGOS LISBOA","SAN JAVIER",3483,7406]
[3488,7406,"ESCUELA IRENE MORALES","SAN JAVIER",3488,7406]
[3480,7406,"ESCUELA JOSE MANUEL BALMACEDA","SAN JAVIER",3480,7406]
[3497,7406,"ESCUELA JOSE MIGUEL CARRERA","SAN JAVIER",3497,7406]
[3491,7406,"ESCUELA JUAN DE DIOS ALDEA","SAN JAVIER",3491,7406]
[3490,7406,"ESCUELA JULIO MONTT SALAMANCA","SAN JAVIER",3490,7406]
[3482,7406,"ESCUELA JUSTA NARVAEZ","SAN JAVIER",3482,7406]
[3481,7406,"ESCUELA MANUEL DE SALAS","SAN JAVIER",3481,7406]
[3494,7406,"ESCUELA MANUEL RODRIGUEZ","SAN JAVIER",3494,7406]
[3495,7406,"ESCUELA PEDRO LAGOS","SAN JAVIER",3495,7406]
[3515,7406,"ESCUELA RAMON CARNICER","SAN JAVIER",3515,7406]
[9430,13129,"CENTRO EDUC. PROVINCIA DE ÑUBLE","SAN JOAQUIN",9430,13129]
[9411,13129,"CENTRO EDUCACIONAL HORACIO ARAVENA A.","SAN JOAQUIN",9411,13129]
[9414,13129,"COLEGIO CIUDAD DE FRANKFORT","SAN JOAQUIN",9414,13129]
[9437,13129,"ESC. BAS. Y ESP. SU SANTIDAD JUAN XXIII","SAN JOAQUIN",9437,13129]
[9457,13129,"ESCUELA BÁSICA POETA NERUDA (EX-483)","SAN JOAQUIN",9457,13129]
[9424,13129,"ESCUELA BASICA FRAY CAMILO HENRIQUEZ","SAN JOAQUIN",9424,13129]
[9429,13129,"ESCUELA POETA VICTOR DOMINGO SILVA","SAN JOAQUIN",9429,13129]
[9421,13129,"LICEO MUNICIPAL SAN JOAQUIN","SAN JOAQUIN",9421,13129]
[10530,13203,"ESCUELA BASICA F-N°629 DE CONCENTRACION FRONTERIZA","SAN JOSE DE MAIPO",10530,13203]
[10528,13203,"ESCUELA BASICA F-N°632 EL CANELO","SAN JOSE DE MAIPO",10528,13203]
[10529,13203,"ESCUELA BASICA F-N°638 EL MELOCOTON","SAN JOSE DE MAIPO",10529,13203]
[10536,13203,"ESCUELA BASICA G-N°635 INTEGRADORA EL MANZANO","SAN JOSE DE MAIPO",10536,13203]
[10537,13203,"ESCUELA BASICA G-N°636 SAN ALFONSO","SAN JOSE DE MAIPO",10537,13203]
[10527,13203,"ESCUELA JULIETA BECERRA ALVAREZ","SAN JOSE DE MAIPO",10527,13203]
[7583,10306,"ESCUELA RURAL PUAUCHO","SAN JUAN DE LA COSTA",7583,10306]
[9433,13130,"ESCUELA BASICA MUNICIPAL","SAN MIGUEL",9433,13130]
[9444,13130,"ESCUELA ESPECIAL LOS CEDROS DEL LIBANO","SAN MIGUEL",9444,13130]
[9413,13130,"ESCUELA GENERAL BASICA SANTA FE","SAN MIGUEL",9413,13130]
[9426,13130,"ESCUELA LLANO SUBERCASEAUX","SAN MIGUEL",9426,13130]
[9415,13130,"ESCUELA TERRITORIO ANTARTICO","SAN MIGUEL",9415,13130]
[9431,13130,"ESCUELA VILLA SAN MIGUEL","SAN MIGUEL",9431,13130]
[3687,8419,"ESCUELA BASICA EL PEUMO","SAN NICOLAS",3687,8419]
[4146,8419,"ESCUELA BASICA LA LOMA","SAN NICOLAS",4146,8419]
[4158,8419,"ESCUELA BASICA MONTELEON","SAN NICOLAS",4158,8419]
[3710,8419,"ESCUELA BASICA PUENTE EL ALA","SAN NICOLAS",3710,8419]
[17898,8419,"ESCUELA SERGIO MARTIN ALAMOS","SAN NICOLAS",17898,8419]
[4141,8419,"LICEO TÉCNICO PUENTE ÑUBLE","SAN NICOLAS",4141,8419]
[7427,10307,"ESCUEAL RURAL QUILEN","SAN PABLO",7427,10307]
[7418,10307,"ESCUELA BASICA SAN PABLO","SAN PABLO",7418,10307]
[7419,10307,"ESCUELA DELICIO CARDENAS BUSTAMANTE","SAN PABLO",7419,10307]
[7432,10307,"ESCUELA RURAL JULIO MOHR SCHULER","SAN PABLO",7432,10307]
[7433,10307,"ESCUELA RURAL LA POZA","SAN PABLO",7433,10307]
[7431,10307,"ESCUELA RURAL TRUMAO","SAN PABLO",7431,10307]
[10856,13505,"ESCUELA BASICA G-N°126","SAN PEDRO",10856,13505]
[10858,13505,"ESCUELA BASICA G-N°128 ATALICIO AGUILAR A.","SAN PEDRO",10858,13505]
[10861,13505,"ESCUELA BASICA G-N°130","SAN PEDRO",10861,13505]
[10864,13505,"ESCUELA BASICA G-N°134 NIHUE","SAN PEDRO",10864,13505]
[10868,13505,"ESCUELA BASICA G-N°139","SAN PEDRO",10868,13505]
[10865,13505,"ESCUELA ENRIQUE REYMOND ALDUNATE","SAN PEDRO",10865,13505]
[10854,13505,"LICEO MUNICIPAL DE SAN PEDRO","SAN PEDRO",10854,13505]
[270,2203,"COMPLEJO EDUCACIONAL TOCONAO","SAN PEDRO DE ATACAMA",270,2203]
[277,2203,"ESCUELA BASICA SAN BARTOLOME","SAN PEDRO DE ATACAMA",277,2203]
[269,2203,"ESCUELA BASICA SAN PEDRO DE ATACAMA","SAN PEDRO DE ATACAMA",269,2203]
[4593,8108,"BASICA SARGENTO CANDELARIA PEREZ","SAN PEDRO DE LA PAZ",4593,8108]
[4617,8108,"COLEGIO GALVARINO DE LOMAS COLORADAS","SAN PEDRO DE LA PAZ",4617,8108]
[18218,8108,"COLEGIO NUEVOS HORIZONTES","SAN PEDRO DE LA PAZ",18218,8108]
[4615,8108,"ESCUELA BASICA BOCA DEL BIO BIO SUR","SAN PEDRO DE LA PAZ",4615,8108]
[4611,8108,"ESCUELA BASICA LUIS ALBERTO ACEVEDO","SAN PEDRO DE LA PAZ",4611,8108]
[4616,8108,"ESCUELA BASICA MICHAIHUE","SAN PEDRO DE LA PAZ",4616,8108]
[4578,8108,"ESCUELA DARIO SALAS MARCHANT","SAN PEDRO DE LA PAZ",4578,8108]
[4595,8108,"ESCUELA ENRIQUE SORO BARRIGA","SAN PEDRO DE LA PAZ",4595,8108]
[4594,8108,"ESCUELA MIGUEL JOSE ZANARTU SANTA MARIA","SAN PEDRO DE LA PAZ",4594,8108]
[3020,7110,"ESCUELA ALTO PANGUE","SAN RAFAEL",3020,7110]
[3028,7110,"ESCUELA EL MILAGRO","SAN RAFAEL",3028,7110]
[3025,7110,"ESCUELA PANGUE ARRIBA","SAN RAFAEL",3025,7110]
[3017,7110,"ESCUELA SAN RAFAEL","SAN RAFAEL",3017,7110]
[9629,13131,"ESCUELA BASICA ALIVEN","SAN RAMON",9629,13131]
[9593,13131,"ESCUELA BASICA EDUCADORES DE CHILE","SAN RAMON",9593,13131]
[9614,13131,"ESCUELA BASICA KARELMAPU","SAN RAMON",9614,13131]
[9592,13131,"ESCUELA BASICA SENDERO DEL SABER","SAN RAMON",9592,13131]
[9611,13131,"ESCUELA BASICA TUPAHUE","SAN RAMON",9611,13131]
[9625,13131,"ESCUELA BASICA VILLA LA CULTURA","SAN RAMON",9625,13131]
[9600,13131,"ESCUELA NANIHUE","SAN RAMON",9600,13131]
[9599,13131,"LICEO MUNICIPAL PURKUYEN","SAN RAMON",9599,13131]
[9586,13131,"LICEO MUNICIPALIZADO ARAUCANIA","SAN RAMON",9586,13131]
[4500,8310,"LICEO ISIDORA AGUIRRE TUPPER","SAN ROSENDO",4500,8310]
[2331,6117,"CENTRO EDUC. REQUEGUA","SAN VICENTE",2331,6117]
[11248,6117,"ESC. ADRIANA ARANGUIZ CERDA","SAN VICENTE",11248,6117]
[2335,6117,"ESC. ENRIQUE YANEZ GONZALEZ","SAN VICENTE",2335,6117]
[2330,6117,"ESC.CARMEN GALLEGOS DE ROBLE","SAN VICENTE",2330,6117]
[2333,6117,"ESC.GUIDO ASSIS GONZALEZ","SAN VICENTE",2333,6117]
[2338,6117,"ESC.JUAN BARROS ROLDAN","SAN VICENTE",2338,6117]
[2347,6117,"ESC.PARROCO M.BUSTAMANTE","SAN VICENTE",2347,6117]
[2336,6117,"ESCUELA EL LIBERTADOR","SAN VICENTE",2336,6117]
[2328,6117,"ESCUELA ESPECIAL PAULA JARAQUEMADA","SAN VICENTE",2328,6117]
[2352,6117,"ESCUELA LAS PATAGUAS","SAN VICENTE",2352,6117]
[2353,6117,"ESCUELA MUNICIPAL CUCHIPUY","SAN VICENTE",2353,6117]
[2341,6117,"ESCUELA MUNICIPAL EL NARANJAL","SAN VICENTE",2341,6117]
[2342,6117,"ESCUELA MUNICIPAL MILLAHUE","SAN VICENTE",2342,6117]
[2334,6117,"ESCUELA MUNICIPAL RASTROJOS","SAN VICENTE",2334,6117]
[2343,6117,"ESCUELA MUNICIPAL TOQUIHUA","SAN VICENTE",2343,6117]
[2348,6117,"ESCUELA MUNICIPAL VINA TAGUA TAGUA","SAN VICENTE",2348,6117]
[2339,6117,"ESCUELA MUNICIPAL ZUNIGA","SAN VICENTE",2339,6117]
[15596,6117,"INSTITUTO SAN VICENTE DE TAGUA TAGUA","SAN VICENTE",15596,6117]
[17813,8311,"ESCUELA BÁSICA CACIQUE LEVIÁN","SANTA BARBARA",17813,8311]
[4352,8311,"ESCUELA BÁSICA ENRIQUE BERNSTEIN CARABANTES","SANTA BARBARA",4352,8311]
[4359,8311,"ESCUELA BASICA MANIL","SANTA BARBARA",4359,8311]
[4357,8311,"ESCUELA BASICA VILLACURA","SANTA BARBARA",4357,8311]
[4355,8311,"ESCUELA DE EDUCACIÓN GENERAL BÁSICA EL HUACHI","SANTA BARBARA",4355,8311]
[4356,8311,"ESCUELA LOS BOLDOS","SANTA BARBARA",4356,8311]
[4358,8311,"ESCUELA MARIANO PUGA VEGA","SANTA BARBARA",4358,8311]
[2560,6310,"ESC. MUNICIPAL LA LAJUELA","SANTA CRUZ",2560,6310]
[2577,6310,"ESCUELA ANGEL ARRIGORRIAGA","SANTA CRUZ",2577,6310]
[2554,6310,"ESCUELA ESPECIAL DE SANTA CRUZ","SANTA CRUZ",2554,6310]
[2557,6310,"ESCUELA GRANJA ADEODATO GARCIA VALENZUELA","SANTA CRUZ",2557,6310]
[2555,6310,"ESCUELA MARIA ARAYA VALDES","SANTA CRUZ",2555,6310]
[2559,6310,"ESCUELA MUNICIPAL DE BARREALES","SANTA CRUZ",2559,6310]
[2576,6310,"ESCUELA MUNICIPAL DE GUINDO ALTO","SANTA CRUZ",2576,6310]
[2562,6310,"ESCUELA MUNICIPAL DE ISLA DE YAQUIL","SANTA CRUZ",2562,6310]
[2563,6310,"ESCUELA MUNICIPAL DE LA PATAGUA","SANTA CRUZ",2563,6310]
[15687,6310,"ESCUELA MUNICIPAL DE LENGUAJE SANTA CRUZ","SANTA CRUZ",15687,6310]
[2570,6310,"ESCUELA MUNICIPAL DE LOS MAITENES","SANTA CRUZ",2570,6310]
[2565,6310,"ESCUELA MUNICIPAL DE MILLAHUE DE APALTA","SANTA CRUZ",2565,6310]
[2556,6310,"ESCUELA MUNICIPAL DE PANIAHUE","SANTA CRUZ",2556,6310]
[2561,6310,"ESCUELA MUNICIPAL DE QUINAHUE","SANTA CRUZ",2561,6310]
[2572,6310,"ESCUELA MUNICIPAL DE RINCON DE YAQUIL","SANTA CRUZ",2572,6310]
[2553,6310,"ESCUELA MUNICIPAL DE SANTA CRUZ","SANTA CRUZ",2553,6310]
[4943,8109,"ESCUELA CHACAYAL","SANTA JUANA",4943,8109]
[17723,8109,"ESCUELA DIEGO PORTALES","SANTA JUANA",17723,8109]
[4926,8109,"ESCUELA RECAREDO VIGUERAS ARANEDA","SANTA JUANA",4926,8109]
[1325,5706,"ESCUELA BASICA AURORA VELASCO PEREZ","SANTA MARIA",1325,5706]
[1321,5706,"ESCUELA GUILLERMO BANADOS HONORATO","SANTA MARIA",1321,5706]
[1326,5706,"ESCUELA JULIO TEJEDOR ZUNIGA","SANTA MARIA",1326,5706]
[1322,5706,"ESCUELA LA HIGUERA","SANTA MARIA",1322,5706]
[1319,5706,"ESCUELA MARIA ESPINOLA CASTRO","SANTA MARIA",1319,5706]
[1323,5706,"ESCUELA SANTA FILOMENA","SANTA MARIA",1323,5706]
[1318,5706,"LICEO DARIO SALAS","SANTA MARIA",1318,5706]
[8562,13101,"CIUDAD SANTIAGO DE CHILE","SANTIAGO",8562,13101]
[8513,13101,"ESC. BAS. REPUBLICA ORIENTAL DE URUGUAY","SANTIAGO",8513,13101]
[8581,13101,"ESCUELA BÁSICA F N║ 64","SANTIAGO",8581,13101]
[8552,13101,"ESCUELA BAS SALVADOR SANFUENTES REP EEUU","SANTIAGO",8552,13101]
[8533,13101,"ESCUELA BASICA BENJAMIN VICUNA MACKENNA","SANTIAGO",8533,13101]
[8531,13101,"ESCUELA BASICA IRENE FREI DE CID","SANTIAGO",8531,13101]
[8520,13101,"ESCUELA BASICA PROVINCIA DE CHILOE","SANTIAGO",8520,13101]
[8522,13101,"ESCUELA BASICA REPUBLICA DE COLOMBIA","SANTIAGO",8522,13101]
[8540,13101,"ESCUELA BASICA REPUBLICA DE HAITI","SANTIAGO",8540,13101]
[8563,13101,"ESCUELA BASICA REPUBLICA DE MEXICO","SANTIAGO",8563,13101]
[8523,13101,"ESCUELA BASICA REPUBLICA DE PANAMA","SANTIAGO",8523,13101]
[8576,13101,"ESCUELA BASICA REYES CATOLICOS","SANTIAGO",8576,13101]
[8530,13101,"ESCUELA CADETE ARTURO PRAT CHACON","SANTIAGO",8530,13101]
[25940,13101,"ESCUELA DE PARV. PARQUE O'HIGGINS","SANTIAGO",25940,13101]
[8586,13101,"ESCUELA DIFERENCIAL JUAN SANDOVAL C","SANTIAGO",8586,13101]
[25277,13101,"ESCUELA ESPECIAL SANTIAGO APOSTOL","SANTIAGO",25277,13101]
[8549,13101,"ESCUELA FERNANDO ALESSANDRI RODRIGUEZ","SANTIAGO",8549,13101]
[8561,13101,"ESCUELA REPUBLICA DE ALEMANIA","SANTIAGO",8561,13101]
[8536,13101,"ESCUELA REPUBLICA DE ISRAEL","SANTIAGO",8536,13101]
[8535,13101,"LICEO REPUBLICA DE BRASIL","SANTIAGO",8535,13101]
[24622,13101,"MIGUEL DE CERVANTES Y SAAVEDRA ANEXO A-8","SANTIAGO",24622,13101]
[2091,5606,"COLEGIO PEOPLE HELP PEOPLE","SANTO DOMINGO",2091,5606]
[2096,5606,"ESCUELA BASICA CLAUDIO VICUNA","SANTO DOMINGO",2096,5606]
[2092,5606,"ESCUELA EL CONVENTO","SANTO DOMINGO",2092,5606]
[371,2103,"ESCUELA CARACOLES","SIERRA GORDA",371,2103]
[370,2103,"ESCUELA ESTACION BAQUEDANO","SIERRA GORDA",370,2103]
[10704,13601,"ESCUELA ALBORADA DE TALAGANTE","TALAGANTE",10704,13601]
[24856,13601,"ESCUELA BASICA TEGUALDA","TALAGANTE",24856,13601]
[10706,13601,"ESCUELA EL PINO VIEJO DE LONQUEN","TALAGANTE",10706,13601]
[10689,13601,"ESCUELA EL ROTO CHILENO","TALAGANTE",10689,13601]
[10705,13601,"ESCUELA LUIS UNDURRAGA","TALAGANTE",10705,13601]
[10702,13601,"ESCUELA MANUEL RODRIGUEZ ERDOIZA","TALAGANTE",10702,13601]
[10699,13601,"ESCUELA REPUBLICA DE GRECIA","TALAGANTE",10699,13601]
[10696,13601,"LICEO POLIVALENTE TALAGANTE","TALAGANTE",10696,13601]
[2968,7101,"ESCUELA ANTUPEHUEN","TALCA",2968,7101]
[2956,7101,"ESCUELA AURORA DE CHILE","TALCA",2956,7101]
[2983,7101,"ESCUELA BASICA PUERTAS NEGRAS","TALCA",2983,7101]
[2955,7101,"ESCUELA BRILLA EL SOL","TALCA",2955,7101]
[2946,7101,"ESCUELA CARLOS SPANO","TALCA",2946,7101]
[11342,7101,"ESCUELA CARLOS TRUPP WANNER","TALCA",11342,7101]
[2989,7101,"ESCUELA CENTINELA","TALCA",2989,7101]
[2965,7101,"ESCUELA COOPERATIVA LIRCAY MANUEL YAÑEZ OLAVE","TALCA",2965,7101]
[2966,7101,"ESCUELA COSTANERA","TALCA",2966,7101]
[2950,7101,"ESCUELA EL EDEN","TALCA",2950,7101]
[2986,7101,"ESCUELA EL ORIENTE","TALCA",2986,7101]
[2979,7101,"ESCUELA EL SAUCE","TALCA",2979,7101]
[2932,7101,"ESCUELA ESPECIAL ESPANA","TALCA",2932,7101]
[2972,7101,"ESCUELA ESPERANZA","TALCA",2972,7101]
[2975,7101,"ESCUELA HUILQUILEMU","TALCA",2975,7101]
[2931,7101,"ESCUELA INÉS SYLVESTER DE ARTOZÓN","TALCA",2931,7101]
[2958,7101,"ESCUELA JOSE ABELARDO NUNEZ","TALCA",2958,7101]
[2942,7101,"ESCUELA JUAN LUIS SANFUENTES","TALCA",2942,7101]
[2951,7101,"ESCUELA LA FLORIDA","TALCA",2951,7101]
[2964,7101,"ESCUELA LAS AMERICAS","TALCA",2964,7101]
[2981,7101,"ESCUELA PANGUILEMO","TALCA",2981,7101]
[2945,7101,"ESCUELA PROSPERIDAD","TALCA",2945,7101]
[2978,7101,"ESCUELA SAN MIGUEL","TALCA",2978,7101]
[2980,7101,"ESCUELA SANTA MARTA","TALCA",2980,7101]
[2941,7101,"ESCUELA SARGENTO 2DO DANIEL REBOLLEDO","TALCA",2941,7101]
[2957,7101,"ESCUELA UNO SAN AGUSTIN","TALCA",2957,7101]
[3111,7101,"ESCUELA VILLA CULENAR","TALCA",3111,7101]
[2952,7101,"ESCUELA VILLA LA PAZ","TALCA",2952,7101]
[2977,7101,"ESCUELA VINA PURISIMA","TALCA",2977,7101]
[16676,7101,"LICEO COMPLEJO EDUCACIONAL JAVIERA CARRERA","TALCA",16676,7101]
[2959,7101,"LORENZO VAROLI GHERARDI","TALCA",2959,7101]
[4711,8110,"ARTURO PRAT CHACON","TALCAHUANO",4711,8110]
[11743,8110,"COLEGIO BASICO LOS LOBOS","TALCAHUANO",11743,8110]
[17693,8110,"COLEGIO BASICO NUEVA LOS LOBOS","TALCAHUANO",17693,8110]
[12023,8110,"COLEGIO BASICO SAN VICENTE","TALCAHUANO",12023,8110]
[4727,8110,"COLEGIO HUACHIPATO","TALCAHUANO",4727,8110]
[4728,8110,"COLEGIO LOS CONDORES","TALCAHUANO",4728,8110]
[4742,8110,"COLEGIO REMODELACION SIMONS","TALCAHUANO",4742,8110]
[4746,8110,"ESCUELA BASICA BUENA VISTA","TALCAHUANO",4746,8110]
[4744,8110,"ESCUELA BASICA CERRO CORNOU","TALCAHUANO",4744,8110]
[4754,8110,"ESCUELA BASICA CERRO SAN FRANCISCO","TALCAHUANO",4754,8110]
[4732,8110,"ESCUELA BASICA CRUZ DEL SUR","TALCAHUANO",4732,8110]
[4724,8110,"ESCUELA BASICA LA DAMA BLANCA","TALCAHUANO",4724,8110]
[4726,8110,"ESCUELA BASICA LAS HIGUERAS","TALCAHUANO",4726,8110]
[4734,8110,"ESCUELA BASICA LIBERTAD","TALCAHUANO",4734,8110]
[4753,8110,"ESCUELA BASICA PENINSULA DE TUMBES","TALCAHUANO",4753,8110]
[4736,8110,"ESCUELA CORNETA CABRALES","TALCAHUANO",4736,8110]
[4720,8110,"ESCUELA D N° 475","TALCAHUANO",4720,8110]
[17836,8110,"ESCUELA DE PÁRVULOS SAN FRANCISCO","TALCAHUANO",17836,8110]
[17837,8110,"ESCUELA DE PARVULOS EL ARENAL","TALCAHUANO",17837,8110]
[4747,8110,"ESCUELA F 500 HUERTOS FAMILIARES","TALCAHUANO",4747,8110]
[4748,8110,"ESCUELA REPUBLICA BOLIVARIANA DE VENEZUELA","TALCAHUANO",4748,8110]
[4750,8110,"ESCUELA SANTA CLARA","TALCAHUANO",4750,8110]
[4712,8110,"ESCUELA SANTA LEONOR","TALCAHUANO",4712,8110]
[17785,8110,"ESCUELA VILLA CENTINELA SUR","TALCAHUANO",17785,8110]
[4725,8110,"ESCUELA VILLA INDEPENDENCIA","TALCAHUANO",4725,8110]
[4733,8110,"LICEO ANITA SERRANO SEPULVEDA","TALCAHUANO",4733,8110]
[12941,2104,"ESCUELA ALONDRA ROJAS BARRIOS","TALTAL",12941,2104]
[374,2104,"ESCUELA HOGAR VICTORIANO QUINTEROS SOTO","TALTAL",374,2104]
[375,2104,"ESCUELA VICTOR CARVAJAL MEZA","TALTAL",375,2104]
[5596,9101,"COLEGIO MUNDO MAGICO","TEMUCO",5596,9101]
[5590,9101,"COMPLEJO EDUC. UN AMANECER EN LA ARAUCANIA","TEMUCO",5590,9101]
[5597,9101,"ESCUELA ALONSO DE ERCILLA","TEMUCO",5597,9101]
[5592,9101,"ESCUELA ANDRES BELLO","TEMUCO",5592,9101]
[20025,9101,"ESCUELA ARTISTICA ARMANDO DUFEY BLANC","TEMUCO",20025,9101]
[5575,9101,"ESCUELA ARTURO PRAT","TEMUCO",5575,9101]
[5645,9101,"ESCUELA BOYECO","TEMUCO",5645,9101]
[5580,9101,"ESCUELA CAMPOS DEPORTIVOS","TEMUCO",5580,9101]
[5647,9101,"ESCUELA COLLIMALLIN","TEMUCO",5647,9101]
[5617,9101,"ESCUELA DE PARVULOS CAMPANITA","TEMUCO",5617,9101]
[5619,9101,"ESCUELA DE PARVULOS SEMILLITA","TEMUCO",5619,9101]
[5598,9101,"ESCUELA ESPECIAL NIELOL","TEMUCO",5598,9101]
[5614,9101,"ESCUELA LABRANZA","TEMUCO",5614,9101]
[5608,9101,"ESCUELA LOS AVELLANOS","TEMUCO",5608,9101]
[5611,9101,"ESCUELA LOS TRIGALES","TEMUCO",5611,9101]
[5630,9101,"ESCUELA MANIO CHICO","TEMUCO",5630,9101]
[5588,9101,"ESCUELA MANUEL RECABARREN","TEMUCO",5588,9101]
[5589,9101,"ESCUELA MILLARAY","TEMUCO",5589,9101]
[5640,9101,"ESCUELA MOLLULCO","TEMUCO",5640,9101]
[5601,9101,"ESCUELA MUNICIPAL EL TRENCITO","TEMUCO",5601,9101]
[5604,9101,"ESCUELA PEDRO DE VALDIVIA","TEMUCO",5604,9101]
[5583,9101,"ESCUELA SANTA ROSA","TEMUCO",5583,9101]
[5582,9101,"ESCUELA STANDAR","TEMUCO",5582,9101]
[5585,9101,"ESCUELA VILLA ALEGRE","TEMUCO",5585,9101]
[5606,9101,"ESCUELA VILLA CAROLINA","TEMUCO",5606,9101]
[5603,9101,"JARDIN INFANTIL MONTE VERDE","TEMUCO",5603,9101]
[5569,9101,"LICEO GABRIELA MISTRAL DE TEMUCO","TEMUCO",5569,9101]
[2804,7308,"ESC. MANUEL RODRIGUEZ ERDOIZA","TENO",2804,7308]
[2805,7308,"ESCUELA ALBORADA VENTANA DEL BAJO","TENO",2805,7308]
[2796,7308,"ESCUELA COMALLE","TENO",2796,7308]
[2806,7308,"ESCUELA HUEMUL","TENO",2806,7308]
[2803,7308,"ESCUELA LAS ARBOLEDAS","TENO",2803,7308]
[2809,7308,"ESCUELA LAS LIRAS","TENO",2809,7308]
[2820,7308,"ESCUELA LOS ALISOS","TENO",2820,7308]
[2801,7308,"ESCUELA MONTERILLA","TENO",2801,7308]
[2800,7308,"ESCUELA MORZA","TENO",2800,7308]
[2816,7308,"ESCUELA PDTE CARLOS IBANEZ DEL CAMPO","TENO",2816,7308]
[2817,7308,"ESCUELA SAN CRISTOBAL","TENO",2817,7308]
[2814,7308,"ESCUELA SAN RAFAEL","TENO",2814,7308]
[2802,7308,"ESCUELA SUSANA MONTES VELASCO","TENO",2802,7308]
[2795,7308,"ESCUELA TENO","TENO",2795,7308]
[6399,9117,"ESCUELA HORIZONTES","TEODORO SCHMIDT",6399,9117]
[6398,9117,"ESCUELA NUEVA ALBORADA","TEODORO SCHMIDT",6398,9117]
[6397,9117,"LICEO MUNICIPAL BARROS ARANA","TEODORO SCHMIDT",6397,9117]
[13118,3103,"ESC. BASICA MARTA EMILIANA AGUILAR ZERON","TIERRA AMARILLA",13118,3103]
[446,3103,"ESCUELA AMOLANAS","TIERRA AMARILLA",446,3103]
[441,3103,"ESCUELA DE CONCENTRACION","TIERRA AMARILLA",441,3103]
[444,3103,"ESCUELA LUIS URIBE ORREGO","TIERRA AMARILLA",444,3103]
[445,3103,"ESCUELA PAUL HARRIS","TIERRA AMARILLA",445,3103]
[442,3103,"ESCUELA VICTOR MANUEL SANCHEZ CABANAS","TIERRA AMARILLA",442,3103]
[10436,13303,"ESCUELA BASICA G-N° 346","TILTIL",10436,13303]
[10435,13303,"ESCUELA BASICA G-N°345 RUNGUE","TILTIL",10435,13303]
[10444,13303,"ESCUELA BASICA G-N°352 PLAZUELA DE POLPAICO","TILTIL",10444,13303]
[10433,13303,"LICEO HUERTOS FAMILIARES","TILTIL",10433,13303]
[10443,13303,"LICEO MONTENEGRO","TILTIL",10443,13303]
[10432,13303,"LICEO POLIVALENTE MANUEL RODRIGUEZ","TILTIL",10432,13303]
[5192,8207,"ESCUELA ANA MOLINA","TIRUA",5192,8207]
[5197,8207,"ESCUELA CASA DE PIEDRA","TIRUA",5197,8207]
[11714,8207,"ESCUELA CHACUIVI","TIRUA",11714,8207]
[5194,8207,"ESCUELA ELOISA GONZALEZ","TIRUA",5194,8207]
[5193,8207,"ESCUELA HECTOR ISAAC CARRASCO HELDT","TIRUA",5193,8207]
[5202,8207,"ESCUELA MAPODUNGUN","TIRUA",5202,8207]
[5196,8207,"ESCUELA PRIMER AGUA","TIRUA",5196,8207]
[205,2301,"ESCUELA ARTURO PRAT CHACON","TOCOPILLA",205,2301]
[201,2301,"ESCUELA CARLOS CONDELL DE LA HAZA","TOCOPILLA",201,2301]
[206,2301,"ESCUELA ESTADOS UNIDOS DE NORTEAMERICA","TOCOPILLA",206,2301]
[12942,2301,"ESCUELA GABRIELA MISTRAL","TOCOPILLA",12942,2301]
[204,2301,"ESCUELA L.GRAL.BERNARDO O┤HIGGINS R.","TOCOPILLA",204,2301]
[203,2301,"ESCUELA PABLO NERUDA","TOCOPILLA",203,2301]
[6349,9118,"ESCUELA AGUAS Y GAVIOTAS","TOLTEN",6349,9118]
[6352,9118,"ESCUELA AMANECER DE VILLA LOS BOLDOS","TOLTEN",6352,9118]
[6351,9118,"ESCUELA EL SEMBRADOR","TOLTEN",6351,9118]
[6350,9118,"ESCUELA RAYEN LAFQUEN QUEULE","TOLTEN",6350,9118]
[4843,8111,"ESCUELA BÁSICA LISA ENRIQUETA PETER TEUBNER","TOME",4843,8111]
[4830,8111,"ESCUELA BÁSICA REP┌BLICA DE ECUADOR","TOME",4830,8111]
[4835,8111,"ESCUELA BASICA ARTURO PRAT","TOME",4835,8111]
[4831,8111,"ESCUELA BASICA BELLAVISTA","TOME",4831,8111]
[4852,8111,"ESCUELA BASICA CALETA DEL MEDIO","TOME",4852,8111]
[4838,8111,"ESCUELA BASICA CARLOS MAHNS CHOUPAY","TOME",4838,8111]
[4841,8111,"ESCUELA BASICA CERRO ESTANQUE","TOME",4841,8111]
[4839,8111,"ESCUELA BASICA COCHOLGUE","TOME",4839,8111]
[4834,8111,"ESCUELA BASICA DICHATO","TOME",4834,8111]
[4832,8111,"ESCUELA BASICA IGNACIO SERRANO MONTANER","TOME",4832,8111]
[4844,8111,"ESCUELA BASICA MENQUE","TOME",4844,8111]
[4855,8111,"ESCUELA BASICA MILLAHUE","TOME",4855,8111]
[4845,8111,"ESCUELA BASICA PUNTA DE PARRA","TOME",4845,8111]
[4837,8111,"ESCUELA BASICA RAFAEL","TOME",4837,8111]
[4836,8111,"ESCUELA BASICA REPUBLICA DE PANAMA","TOME",4836,8111]
[4848,8111,"ESCUELA BASICA SAN CARLITOS","TOME",4848,8111]
[4860,8111,"ESCUELA BASICA VEGAS DE COLIUMO","TOME",4860,8111]
[4840,8111,"ESCUELA BASICA Y ADULTOS CALIFORNIA","TOME",4840,8111]
[11394,8111,"ESCUELA GABRIELA MISTRAL","TOME",11394,8111]
[4842,8111,"ESCUELA MARIANO EGANA","TOME",4842,8111]
[8410,11303,"ESCUELA MUNICIPAL CDTE LUIS BRAVO BRAVO","TORTEL",8410,11303]
[5442,9210,"ESCUELA BASICA EMILIA ROMAGNA","TRAIGUEN",5442,9210]
[5446,9210,"ESCUELA DIEGO PORTALES","TRAIGUEN",5446,9210]
[20058,9210,"ESCUELA ESPECIAL LAS LILAS DE TRAIGUEN","TRAIGUEN",20058,9210]
[5441,9210,"ESCUELA REPUBLICA DE ISRAEL","TRAIGUEN",5441,9210]
[4071,8420,"ESCUELA BÁSICA VALLE LONQUÉN","TREGUACO",4071,8420]
[16802,8420,"ESCUELA ESPECIAL DE LENGUAJE SONRISAS","TREGUACO",16802,8420]
[4312,8312,"ESCUELA ALEJANDRO PEREZ URBANO","TUCAPEL",4312,8312]
[4310,8312,"ESCUELA BASICA TUCAPEL","TUCAPEL",4310,8312]
[4311,8312,"ESCUELA LOS AVELLANOS","TUCAPEL",4311,8312]
[11711,8312,"ESCUELA LUIS MARTÍNEZ GONZÁLEZ","TUCAPEL",11711,8312]
[6765,14101,"COLEGIO DEPORTIVO MUNICIPAL DE VALDIVIA","VALDIVIA",6765,14101]
[6766,14101,"COLEGIO TENIENTE HERNAN MERINO CORREA","VALDIVIA",6766,14101]
[6781,14101,"ESCUELA ALEMANIA","VALDIVIA",6781,14101]
[6785,14101,"ESCUELA ANGACHILLA","VALDIVIA",6785,14101]
[6759,14101,"ESCUELA CHILE","VALDIVIA",6759,14101]
[6791,14101,"ESCUELA DE NIEBLA JUAN BOSCH","VALDIVIA",6791,14101]
[22532,14101,"ESCUELA EL BOSQUE","VALDIVIA",22532,14101]
[6774,14101,"ESCUELA EL LAUREL","VALDIVIA",6774,14101]
[6764,14101,"ESCUELA ESPANA","VALDIVIA",6764,14101]
[6786,14101,"ESCUELA ESPECIAL WALTER SCHMIDT ROESTEL","VALDIVIA",6786,14101]
[6777,14101,"ESCUELA FEDOR M.DOSTOIEVSKI","VALDIVIA",6777,14101]
[6780,14101,"ESCUELA FERNANDO SANTIVAN","VALDIVIA",6780,14101]
[22333,14101,"ESCUELA FRANCIA","VALDIVIA",22333,14101]
[6773,14101,"ESCUELA LAS ANIMAS","VALDIVIA",6773,14101]
[6767,14101,"ESCUELA LEONARDO DA VINCI","VALDIVIA",6767,14101]
[6762,14101,"ESCUELA MEXICO","VALDIVIA",6762,14101]
[6816,14101,"ESCUELA RURAL CAYUMAPU","VALDIVIA",6816,14101]
[6793,14101,"ESCUELA RURAL HUELLELHUE","VALDIVIA",6793,14101]
[6815,14101,"ESCUELA RURAL LOS MOLINOS","VALDIVIA",6815,14101]
[13121,3301,"ESC.BASICA CAPITAN RAFAEL TORREBLANCA","VALLENAR",13121,3301]
[458,3301,"ESCUELA ARTURO PEREZ CANTO","VALLENAR",458,3301]
[459,3301,"ESCUELA BASICA ESPANA","VALLENAR",459,3301]
[464,3301,"ESCUELA BASICA GUALBERTO KONG FERNANDEZ","VALLENAR",464,3301]
[463,3301,"ESCUELA BASICA ROBERTO CUADRA ALQUINTA","VALLENAR",463,3301]
[471,3301,"ESCUELA BASICA SARA BEMBOW VILLEGAS","VALLENAR",471,3301]
[476,3301,"ESCUELA BASICA SOR TERESA DE LOS ANDES","VALLENAR",476,3301]
[13167,3301,"ESCUELA EDMUNDO QUEZADA ARAYA","VALLENAR",13167,3301]
[452,3301,"ESCUELA GABRIELA MISTRAL","VALLENAR",452,3301]
[454,3301,"ESCUELA GREGORIO CASTILLO MARÍN","VALLENAR",454,3301]
[450,3301,"ESCUELA HERMANOS CARRERA","VALLENAR",450,3301]
[453,3301,"ESCUELA IGNACIO CARRERA PINTO","VALLENAR",453,3301]
[462,3301,"ESCUELA JOSE CAROCA LAFLOR","VALLENAR",462,3301]
[461,3301,"ESCUELA LUIS CRUZ MARTINEZ","VALLENAR",461,3301]
[455,3301,"ESCUELA REPUBLICA DE LOS E.E.U.U.","VALLENAR",455,3301]
[1506,5101,"CENTRO EDUCATIVO FLORIDA","VALPARAISO",1506,5101]
[1554,5101,"COLEGIO PABLO NERUDA","VALPARAISO",1554,5101]
[1522,5101,"COLEGIO PEDRO MONTT","VALPARAISO",1522,5101]
[1508,5101,"ESC. ESPEC. DE DEF. MENTAL GRAN BRETA_A","VALPARAISO",1508,5101]
[1533,5101,"ESCUELA ALEMANIA","VALPARAISO",1533,5101]
[1536,5101,"ESCUELA AMERICA","VALPARAISO",1536,5101]
[1570,5101,"ESCUELA BASICA CIRUJANO VIDELA","VALPARAISO",1570,5101]
[1540,5101,"ESCUELA BLAS CUEVAS RAMON ALLENDE","VALPARAISO",1540,5101]
[1547,5101,"ESCUELA CARABINERO PEDRO A.CARIAGA M.","VALPARAISO",1547,5101]
[1548,5101,"ESCUELA DIEGO PORTALES PALAZUELOS","VALPARAISO",1548,5101]
[1573,5101,"ESCUELA DR. ERNESTO QUIROZ WEBER","VALPARAISO",1573,5101]
[1556,5101,"ESCUELA ELEUTERIO RAMIREZ","VALPARAISO",1556,5101]
[1553,5101,"ESCUELA ESPANA","VALPARAISO",1553,5101]
[1510,5101,"ESCUELA ESPECIAL DE LENGUAJE LIBERTADOR DE LA PATRIA BERNARDO O'HIGGINS","VALPARAISO",1510,5101]
[1528,5101,"ESCUELA GASPAR CABRALES","VALPARAISO",1528,5101]
[1529,5101,"ESCUELA GRECIA","VALPARAISO",1529,5101]
[1514,5101,"ESCUELA HERNAN OLGUIN","VALPARAISO",1514,5101]
[1542,5101,"ESCUELA JOAQUIN EDWARDS BELLO","VALPARAISO",1542,5101]
[1543,5101,"ESCUELA JORGE ALESSANDRI RODRIGUEZ","VALPARAISO",1543,5101]
[14678,5101,"ESCUELA JUAN DE SAAVEDRA","VALPARAISO",14678,5101]
[1538,5101,"ESCUELA JUAN JOSE LATORRE B","VALPARAISO",1538,5101]
[1563,5101,"ESCUELA JUAN WACQUEZ MOURFIN","VALPARAISO",1563,5101]
[1551,5101,"ESCUELA MONTEDONICO","VALPARAISO",1551,5101]
[1523,5101,"ESCUELA NACIONES UNIDAS","VALPARAISO",1523,5101]
[1550,5101,"ESCUELA PACIFICO","VALPARAISO",1550,5101]
[1569,5101,"ESCUELA PILOTO 1° LUIS PARDO VILLALON","VALPARAISO",1569,5101]
[1537,5101,"ESCUELA RAMON BARROS LUCO","VALPARAISO",1537,5101]
[1524,5101,"ESCUELA REPUBLICA ARABE SIRIA","VALPARAISO",1524,5101]
[1568,5101,"ESCUELA REPUBLICA ARGENTINA","VALPARAISO",1568,5101]
[1541,5101,"ESCUELA REPUBLICA DE EL SALVADOR","VALPARAISO",1541,5101]
[1555,5101,"ESCUELA REPUBLICA DE ISRAEL","VALPARAISO",1555,5101]
[1549,5101,"ESCUELA REPUBLICA DE MEXICO","VALPARAISO",1549,5101]
[1526,5101,"ESCUELA REPUBLICA DEL PARAGUAY","VALPARAISO",1526,5101]
[1534,5101,"ESCUELA REPUBLICA DEL URUGUAY","VALPARAISO",1534,5101]
[1571,5101,"ESCUELA SAN JUDAS TADEO","VALPARAISO",1571,5101]
[1557,5101,"ESCUELA VILLA BERLIN","VALPARAISO",1557,5101]
[1521,5101,"LICEO DE NINAS MARIA FRANCK DE MACDOUGAL","VALPARAISO",1521,5101]
[1518,5101,"LICEO MARIA LUISA BOMBAL","VALPARAISO",1518,5101]
[1517,5101,"LICEO MATILDE BRANDAU DE ROSS","VALPARAISO",1517,5101]
[1516,5101,"LICEO TECNOLÓGICO ALFREDO NAZAR FERES","VALPARAISO",1516,5101]
[2914,7309,"ESCUELA EMA CORNEJO DE CARDOEN","VICHUQUEN",2914,7309]
[2910,7309,"ESCUELA ENTRE AGUAS DE LLICO","VICHUQUEN",2910,7309]
[2911,7309,"ESCUELA LAGO VICHUQUEN","VICHUQUEN",2911,7309]
[2909,7309,"LICEO NUEVO HORIZONTE","VICHUQUEN",2909,7309]
[5396,9211,"COLEGIO IGNACIO CARRERA PINTO","VICTORIA",5396,9211]
[5407,9211,"ESCUELA BASICA PATRICIO LINCH","VICTORIA",5407,9211]
[5425,9211,"ESCUELA BASICA SANTA ELENA","VICTORIA",5425,9211]
[5398,9211,"ESCUELA HEROES DE IQUIQUE","VICTORIA",5398,9211]
[5395,9211,"ESCUELA MARCELA PAZ","VICTORIA",5395,9211]
[5411,9211,"ESCUELA MUNICIPAL MONICA GEBERT MEIER","VICTORIA",5411,9211]
[5408,9211,"ESCUELA PAILAHUEQUE","VICTORIA",5408,9211]
[5406,9211,"ESCUELA SELVA OSCURA","VICTORIA",5406,9211]
[13512,4106,"COLEGIO JOAQUIN VICUÑA LARRAIN","VICUÑA",13512,4106]
[678,4106,"ESCUELA AMELIA BARAHONA MUJICA","VICUÑA",678,4106]
[666,4106,"ESCUELA BASICA LUCILA GODOY ALCAYAGA","VICUÑA",666,4106]
[682,4106,"ESCUELA DAGOBERTO CAMPOS NUNEZ","VICUÑA",682,4106]
[672,4106,"ESCUELA DE DIAGUITAS JUAN TORRES M.","VICUÑA",672,4106]
[668,4106,"ESCUELA EDMUNDO VIDAL CARDENAS","VICUÑA",668,4106]
[680,4106,"ESCUELA FEDERICO BARNES PAYNE","VICUÑA",680,4106]
[673,4106,"ESCUELA JOSE ABELARDO NUNEZ","VICUÑA",673,4106]
[669,4106,"ESCUELA NEFTALI REYES","VICUÑA",669,4106]
[671,4106,"ESCUELA RIOS DE ELQUI","VICUÑA",671,4106]
[1682,5109,"COLEGIO MIRAFLORES","VIÑA DEL MAR",1682,5109]
[1681,5109,"COLEGIO REPUBLICA DE COLOMBIA","VIÑA DEL MAR",1681,5109]
[1688,5109,"ESCUELA ALMIRANTE LUIS GOMEZ CARRENO","VIÑA DEL MAR",1688,5109]
[1692,5109,"ESCUELA ARTURO PRAT CHACON","VIÑA DEL MAR",1692,5109]
[1693,5109,"ESCUELA BASICA 21 DE MAYO","VIÑA DEL MAR",1693,5109]
[1696,5109,"ESCUELA BASICA CHORRILOS","VIÑA DEL MAR",1696,5109]
[1722,5109,"ESCUELA BASICA DR ALDO FRANCIA BOIDO","VIÑA DEL MAR",1722,5109]
[12171,5109,"ESCUELA BASICA HUMBERTO VILCHEZ ALZAMORA","VIÑA DEL MAR",12171,5109]
[1704,5109,"ESCUELA BASICA JOHN KENNEDY","VIÑA DEL MAR",1704,5109]
[1728,5109,"ESCUELA BASICA LUISA NIETO DE HAMEL","VIÑA DEL MAR",1728,5109]
[1677,5109,"ESCUELA BASICA REPUBLICA DEL ECUADOR","VIÑA DEL MAR",1677,5109]
[1721,5109,"ESCUELA BASICA REPUBLICA DEL LIBANO","VIÑA DEL MAR",1721,5109]
[1683,5109,"ESCUELA BASICA SANTA JULIA","VIÑA DEL MAR",1683,5109]
[1702,5109,"ESCUELA CANAL BEAGLE","VIÑA DEL MAR",1702,5109]
[1717,5109,"ESCUELA CARDENAL JOSE MARIA CARO","VIÑA DEL MAR",1717,5109]
[1700,5109,"ESCUELA DOCTOR ADRIANO MACHADO PARDO","VIÑA DEL MAR",1700,5109]
[1685,5109,"ESCUELA DR. OSCAR MARIN SOCIAS","VIÑA DEL MAR",1685,5109]
[1718,5109,"ESCUELA EDUARDO LEZANA PINCHEIRA","VIÑA DEL MAR",1718,5109]
[1708,5109,"ESCUELA ENRIQUE CARDENAS RIVERA","VIÑA DEL MAR",1708,5109]
[1667,5109,"ESCUELA ESPECIAL ADOLFO TANNENBAUM B.","VIÑA DEL MAR",1667,5109]
[1669,5109,"ESCUELA ESPECIAL JUANITA DE AGUIRRE CERDA","VIÑA DEL MAR",1669,5109]
[1697,5109,"ESCUELA GASTON OSSA SAINT MARIE","VIÑA DEL MAR",1697,5109]
[1701,5109,"ESCUELA LA PARVA","VIÑA DEL MAR",1701,5109]
[1684,5109,"ESCUELA LIBERTADOR BERNARDO O^HIGGINS","VIÑA DEL MAR",1684,5109]
[1691,5109,"ESCUELA LORD COCHRANE","VIÑA DEL MAR",1691,5109]
[1720,5109,"ESCUELA MARCELA PAZ","VIÑA DEL MAR",1720,5109]
[1680,5109,"ESCUELA ORLANDO PENA CARVAJAL","VIÑA DEL MAR",1680,5109]
[1709,5109,"ESCUELA PATRICIO LYNCH Z.","VIÑA DEL MAR",1709,5109]
[1698,5109,"ESCUELA PAUL HARRIS","VIÑA DEL MAR",1698,5109]
[1695,5109,"ESCUELA PEDRO AGUIRRE CERDA","VIÑA DEL MAR",1695,5109]
[1724,5109,"ESCUELA PRESIDENTE EDUARDO FREI MONTALVA","VIÑA DEL MAR",1724,5109]
[1703,5109,"ESCUELA PRESIDENTE JOSE MANUEL BALMACEDA","VIÑA DEL MAR",1703,5109]
[1705,5109,"ESCUELA PRESIDENTE SALVADOR ALLENDE","VIÑA DEL MAR",1705,5109]
[1714,5109,"ESCUELA SANTA MARIA DE AGUA SANTA","VIÑA DEL MAR",1714,5109]
[1686,5109,"ESCUELA TEODORO LOWEY","VIÑA DEL MAR",1686,5109]
[1678,5109,"ESCUELA UNESCO","VIÑA DEL MAR",1678,5109]
[1716,5109,"ESCUELA VILLA INDEPENDENCIA","VIÑA DEL MAR",1716,5109]
[1712,5109,"ESCUELA VILLA MONTE","VIÑA DEL MAR",1712,5109]
[1732,5109,"ESCUELA VIOLETA PARRA","VIÑA DEL MAR",1732,5109]
[14347,5109,"INST.DEL DISCAP.VISUAL ANTONIO MOSQUETE","VIÑA DEL MAR",14347,5109]
[5897,9119,"COLEGIO AMERICA","VILCUN",5897,9119]
[5613,9119,"COMPLEJO EDUCACIONAL LA GRANJA","VILCUN",5613,9119]
[5901,9119,"ESC. BASICA VEGA REDONDA","VILCUN",5901,9119]
[5899,9119,"ESCUELA DAGOBERTO GODOY","VILCUN",5899,9119]
[5896,9119,"ESCUELA JAPON","VILCUN",5896,9119]
[5902,9119,"ESCUELA MARTIN ALONQUEO PIUTRIN","VILCUN",5902,9119]
[3467,7407,"ESCUELA ALCALDE MANUEL SALVADOR DEL C.","VILLA ALEGRE",3467,7407]
[3466,7407,"ESCUELA ALCALDE ORLANDO RODRIGUEZ DEL C.","VILLA ALEGRE",3466,7407]
[3465,7407,"ESCUELA ALCALDE SERAFIN GUTIERREZ F.","VILLA ALEGRE",3465,7407]
[3319,7407,"ESCUELA ALFREDO NOGUERA PRIETO","VILLA ALEGRE",3319,7407]
[3464,7407,"ESCUELA HERNAN LOBOS ARIAS","VILLA ALEGRE",3464,7407]
[3475,7407,"ESCUELA JOSE PALMA FERNANDEZ","VILLA ALEGRE",3475,7407]
[3471,7407,"ESCUELA PROFESOR RAMON LEIVA NARVAEZ","VILLA ALEGRE",3471,7407]
[3462,7407,"ESCUELA TIMOTEO ARAYA ALEGRIA","VILLA ALEGRE",3462,7407]
[3470,7407,"ESCUELA TRINIDAD ALCAINO TAPIA","VILLA ALEGRE",3470,7407]
[1969,5804,"COLEGIO CHARLES DARWIN","VILLA ALEMANA",1969,5804]
[1965,5804,"COLEGIO ITALO COMPOSTO SCARPATI","VILLA ALEMANA",1965,5804]
[1966,5804,"ESCUELA BASICA CATALUNYA","VILLA ALEMANA",1966,5804]
[1963,5804,"ESCUELA BASICA DIEGO BARROS ARANA","VILLA ALEMANA",1963,5804]
[1970,5804,"ESCUELA DIEGO PORTALES","VILLA ALEMANA",1970,5804]
[1976,5804,"ESCUELA EL PATAGUAL","VILLA ALEMANA",1976,5804]
[1975,5804,"ESCUELA JUAN BAUTISTA ALBERDI","VILLA ALEMANA",1975,5804]
[1961,5804,"ESCUELA LATINA INES GALLARDO ORELLANA","VILLA ALEMANA",1961,5804]
[1971,5804,"ESCUELA MANUEL MONTT","VILLA ALEMANA",1971,5804]
[1967,5804,"LICEO BICENTENARIO TÉCNICO PROFESIONAL MARY GRAHAM","VILLA ALEMANA",1967,5804]
[1959,5804,"WINDMILL COLLEGE","VILLA ALEMANA",1959,5804]
[6087,9120,"ESCUELA ALEXANDER GRAHAM BELL","VILLARRICA",6087,9120]
[6092,9120,"ESCUELA EPUKLEI","VILLARRICA",6092,9120]
[6086,9120,"ESCUELA JOSE ABELARDO NUNEZ","VILLARRICA",6086,9120]
[6108,9120,"ESCUELA MANANTIAL","VILLARRICA",6108,9120]
[6090,9120,"ESCUELA MARIANO LATORRE","VILLARRICA",6090,9120]
[6088,9120,"ESCUELA VALENTIN LETELIER","VILLARRICA",6088,9120]
[6089,9120,"ESCUELA VOIPIR DE NANCUL","VILLARRICA",6089,9120]
[8825,13132,"COLEGIO ANTARTICA CHILENA","VITACURA",8825,13132]
[8821,13132,"LICEO MUNICIPALIZADO AMANDA LABARCA","VITACURA",8821,13132]
[3318,7408,"ESCUELA JORGE SALGADO PICA","YERBAS BUENAS",3318,7408]
[3323,7408,"ESCUELA LUIS AMBROSIO CONCHA","YERBAS BUENAS",3323,7408]
[3314,7408,"ESCUELA MAITENCILLO","YERBAS BUENAS",3314,7408]
[3316,7408,"ESCUELA SANTA ANA DE QUERI","YERBAS BUENAS",3316,7408]
[3321,7408,"ESCUELA SANTA ELENA","YERBAS BUENAS",3321,7408]
[3315,7408,"ESCUELA SILVANO FERNANDEZ","YERBAS BUENAS",3315,7408]
[3313,7408,"LICEO JUAN DE DIOS PUGA","YERBAS BUENAS",3313,7408]
[3317,7408,"LICEO JUAN GOMEZ MILLAS","YERBAS BUENAS",3317,7408]
[18021,8313,"ESCUELA DIEGO PORTALES PALAZUELOS","YUMBEL",18021,8313]
[4512,8313,"ESCUELA ENRIQUE PUFFE KIND","YUMBEL",4512,8313]
[4506,8313,"ESCUELA HÉROES DE CHILE","YUMBEL",4506,8313]
[4527,8313,"ESCUELA MUNICIPAL CERRO PARRA","YUMBEL",4527,8313]
[4514,8313,"ESCUELA MUNICIPAL RERE","YUMBEL",4514,8313]
[4513,8313,"ESCUELA PADRE PEDRO CAMPOS MENCHACA","YUMBEL",4513,8313]
[4509,8313,"LICEO MUNICIPAL RIO CLARO","YUMBEL",4509,8313]
[4507,8313,"LICEO TÉCNICO PROFESIONAL GONZALO GUGLIELMI MONTIEL","YUMBEL",4507,8313]
[3955,8421,"ESCUELA BASICA RANCHILLOS","YUNGAY",3955,8421]
[11405,8421,"ESCUELA FERNANDO BAQUEDANO","YUNGAY",11405,8421]
[3957,8421,"ESCUELA LOS MAYOS","YUNGAY",3957,8421]
[3941,8421,"LICEO CAMPANARIO","YUNGAY",3941,8421]
[1184,5405,"ESCUELA BASICA MERCEDES MATURANA GALLARDO","ZAPALLAR",1184,5405]
[1183,5405,"LICEO DE ZAPALLAR","ZAPALLAR",1183,5405]

{"sheet":"Hoja2","index":2,"n_rows":1008,"n_cols":358,"rows_kept":1008,"cut":false,"hidden":false,"merged":[[0,2,0,11],[2,6,2,7],[3,6,3,8],[6,5,6,6],[6,8,6,9]]}
[null,null,"FORMULARIO DE ENTREGA RINCON DE JUEGOS (RINJU)",null,null,null,null,null,null,null,null,null,null,null,"niño",null,null,null,null,"COMUNAS",null,"AISEN","ALGARROBO","ALHUE","ALTO BIOBIO","ALTO DEL CARMEN","ALTO HOSPICIO","ANCUD","ANDACOLLO","ANGOL","ANTOFAGASTA","ANTUCO","ARAUCO","ARICA","BUIN","BULNES","CABILDO","CABO DE HORNOS","CABRERO","CAÑETE","CALAMA","CALBUCO","CALDERA","CALERA","CALERA DE TANGO","CALLE LARGA","CANELA","CARAHUE","CARTAGENA","CASABLANCA","CASTRO","CATEMU","CAUQUENES","CERRILLOS","CERRO NAVIA","CHAÑARAL","CHAITEN","CHANCO","CHEPICA","CHIGUAYANTE","CHILE CHICO","CHILLAN","CHILLAN VIEJO","CHIMBARONGO","CHOLCHOL","CHONCHI","CISNES","COBQUECURA","COCHAMO","COCHRANE","CODEGUA","COELEMU","COIHAIQUE","COIHUECO","COINCO","COLBUN","COLCHANE","COLINA","COLLIPULLI","COLTAUCO","COMBARBALA","CONCEPCION","CONCHALI","CONCON","CONSTITUCION","CONTULMO","COPIAPO","COQUIMBO","CORONEL","CORRAL","CUNCO","CURACAUTIN","CURACAVI","CURACO DE VELEZ","CURANILAHUE","CURARREHUE","CUREPTO","CURICO","DALCAHUE","DIEGO DE ALMAGRO","ÑIQUEN","DOÑIHUE","ÑUÑOA","EL BOSQUE","EL CARMEN","EL MONTE","EL QUISCO","EL TABO","EMPEDRADO","ERCILLA","ESTACION CENTRAL","FLORIDA","FREIRE","FREIRINA","FRESIA","FRUTILLAR","FUTALEUFU","FUTRONO","GALVARINO","GORBEA","GRANEROS","GUAITECAS","HIJUELAS","HUALAÑE","HUALAIHUE","HUALPEN","HUALQUI","HUARA","HUASCO","HUECHURABA","ILLAPEL","INDEPENDENCIA","IQUIQUE","ISLA DE MAIPO","ISLA DE PASCUA","JUAN FERNANDEZ","LA CISTERNA","LA CRUZ","LA ESTRELLA","LA FLORIDA","LA GRANJA","LA HIGUERA","LA LIGUA","LA PINTANA","LA REINA","LA SERENA","LA UNION","LAGO RANCO","LAJA","LAMPA","LANCO","LAS CABRAS","LAS CONDES","LAUTARO","LEBU","LICANTEN","LIMACHE","LINARES","LITUECHE","LLAILLAY","LLANQUIHUE","LO BARNECHEA","LO ESPEJO","LO PRADO","LOLOL","LONCOCHE","LONGAVI","LONQUIMAY","LOS ALAMOS","LOS ANDES","LOS ANGELES","LOS LAGOS","LOS MUERMOS","LOS SAUCES","LOS VILOS","LOTA","LUMACO","MACHALI","MACUL","MAFIL","MAIPU","MALLOA","MARCHIHUE","MARIA ELENA","MARIA PINTO","MARIQUINA","MAULE","MAULLIN","MEJILLONES","MELIPEUCO","MELIPILLA","MOLINA","MONTE PATRIA","MOSTAZAL","MULCHEN","NACIMIENTO","NANCAGUA","NATALES","NAVIDAD","NEGRETE","NINHUE","NOGALES","NUEVA IMPERIAL","O'HIGGINS","OLIVAR","OLMUE","OSORNO","OVALLE","PADRE HURTADO","PADRE LAS CASAS","PAIGUANO","PAILLACO","PAINE","PALENA","PALMILLA","PANGUIPULLI","PANQUEHUE","PAPUDO","PAREDONES","PARRAL","PEÑAFLOR","PEÑALOLEN","PEDRO AGUIRRE CERDA","PELARCO","PELLUHUE","PEMUCO","PENCAHUE","PENCO","PERALILLO","PERQUENCO","PETORCA","PEUMO","PICA","PICHIDEGUA","PICHILEMU","PINTO","PIRQUE","PITRUFQUEN","PLACILLA","PORTEZUELO","PORVENIR","POZO ALMONTE","PRIMAVERA","PROVIDENCIA","PUCHUNCAVI","PUCON","PUDAHUEL","PUENTE ALTO","PUERTO MONTT","PUERTO OCTAY","PUERTO VARAS","PUMANQUE","PUNITAQUI","PUNTA ARENAS","PUQUELDON","PUREN","PURRANQUE","PUTAENDO","PUTRE","PUYEHUE","QUEILEN","QUELLON","QUEMCHI","QUILACO","QUILICURA","QUILLECO","QUILLON","QUILLOTA","QUILPUE","QUINCHAO","QUINTA DE TILCOCO","QUINTA NORMAL","QUINTERO","QUIRIHUE","RANCAGUA","RANQUIL","RAUCO","RECOLETA","RENAICO","RENCA","RENGO","REQUINOA","RETIRO","RINCONADA","RIO BUENO","RIO CLARO","RIO HURTADO","RIO IBAÑEZ","RIO NEGRO","RIO VERDE","ROMERAL","SAAVEDRA","SAGRADA FAMILIA","SALAMANCA","SAN ANTONIO","SAN BERNARDO","SAN CARLOS","SAN CLEMENTE","SAN ESTEBAN","SAN FABIAN","SAN FELIPE","SAN FERNANDO","SAN GREGORIO","SAN IGNACIO","SAN JAVIER","SAN JOAQUIN","SAN JOSE DE MAIPO","SAN JUAN DE LA COSTA","SAN MIGUEL","SAN NICOLAS","SAN PABLO","SAN PEDRO","SAN PEDRO DE ATACAMA","SAN PEDRO DE LA PAZ","SAN RAFAEL","SAN RAMON","SAN ROSENDO","SAN VICENTE","SANTA BARBARA","SANTA CRUZ","SANTA JUANA","SANTA MARIA","SANTIAGO","SANTO DOMINGO","SIERRA GORDA","TALAGANTE","TALCA","TALCAHUANO","TALTAL","TEMUCO","TENO","TEODORO SCHMIDT","TIERRA AMARILLA","TILTIL","TIRUA","TOCOPILLA","TOLTEN","TOME","TORTEL","TRAIGUEN","TREGUACO","TUCAPEL","VALDIVIA","VALLENAR","VALPARAISO","VICHUQUEN","VICTORIA","VICUÑA","VIÑA DEL MAR","VILCUN","VILLA ALEGRE","VILLA ALEMANA","VILLARRICA","VITACURA","YERBAS BUENAS","YUMBEL","YUNGAY","ZAPALLAR"]
[null,null,null,null,null,null,null,null,null,null,null,null,null,null,"adulto",null,null,null,null,"AISEN",null,"ESCUELA ALMIRANTE SIMPSON","COLEGIO CARLOS ALESSANDRI ALTAMIRANO","ESCUELA BARRANCAS DE PICHI","ESCUELA BASICA PITRIL","EDUCADOR ARTURO ALVEAR RAMOS","COLEGIO SIMON BOLIVAR","ESCUELA ANEXA","COLEGIO NUESTRA SEÑORA DEL ROSARIO","COLEGIO MAR-A SYLVESTER RASCH","ESCUELA ALCALDE MAXIMILIANO POBLETE","ESCUELA OLGA RIOS DE PINOCHET","ESCUELA BÁSICA DE CARAMPANGUE","COLEGIO CENTENARIO DE ARICA","COLEGIO DE MAIPO","ESCUELA BASICA EDUARDO FREI MONTALBA","ESCUELA BASICA G-45","LICEO DONALD MC-INTYRE GRIFFITHS","ESCUELA ALTO CABRERO","ESCUELA ARTURO PRAT CHACON","ESCUELA BASICA SENORA DE LA CANDELARIA","ESCUELA EULOGIO GOYCOLEA GARAY","BYRON GIGOUX JAMES","COMPLEJO EDUCACIONAL LAS ACACIAS DE ARTIFICIO","ESCUELA BASICA F-N¦798 CALERA DE TANGO","ESCUELA BASICA CRISTO REDENTOR","ESC.BASICA CARLOS VIAL ESPANTOSO","ESCUELA BASICA KIM RUKA","ESCUELA BASICA SAN FRANCISCO","ESCUELA ARTURO ECHAZARRETA LARRAIN","ESCUELA AYTUE","ESCUELA BASICA EL NILHUE","COLEGIO BLANCO ENCALADA","EJERCITO LIBERTADOR DE CERRILLOS","COLEGIO NEPTUNO","ESC. BAS. DIFERENCIAL JOSE LUIS OLIVARES A.","ESCUELA BASICA ALMIRANTE JUAN JOSE LATORRE","ESCUELA ESPECIAL DE LENGUAJE POLHUIN","CENTRO DE RECURSOS EDUCATIVO INTEGRARTE","ESCUELA BALMACEDA SAAVEDRA L.","ESC. LIBERTADOR BERNARDO O¦HIGGINS RIQUELME","ESC. BASICA ARTURO MUTIZABAL SOTOMAYOR","ESCUELA BASICA LOS COLIGUES","CENTRO PARVULARIO DE CHIMBARONGO","ESC. BASICA EL PROGRESO","ESCUELA BASICA SAN CARLOS DE CHONCHI","ESCUELA EUSEBIO IBAR SCHEPELER","ESCUELA BASICA BUCHUPUREO","ESCUELA BASICA FRONTERIZA JUAN SOLER MANFREDINI","ESC. BASICA HERNAN MERINO CORREA","COLEGIO JESUS ANDINO","ESCUELA CLEMENTINA MAUREIRA ALMANZA","ESCUELA BAQUEDANO","ESCUELA BASICA NIBLINTO","COLEGIO MUNICIPAL HUALLILEN","ESCUELA ANDRES BELLO","LICEO TECNICO PROFESIONAL COLCHANE","ANDALIEN DE COLINA","ESCUELA BASICA MIGUEL HUENTELEN","COLEGIO NUESTRA SEÑORA DE LORETO","ESCUELA BASICA AMERICA","COLEGIO BICENTENARIO REP+BLICA DEL BRASIL","CENTRO EDUC. POETA EUSEBIO LILLO","ESCUELA BASICA IRMA SALAS SILVA","ESCUELA CHACARILLAS","ESCUELA CALEBU","COLEGIO BUEN PASTOR","COLEGIO LA HERRADURA","ESCUELA ADELAIDA MIGUIELES SOTO","ESCUELA BASICA DE CORRAL","ESCUELA AURORA DE CHILE","ESCUELA BASICA REPUBLICA DE MEXICO","ESCUELA BAS. MUNIC. CUYUNCAVI","ESCUELA RURAL EDUARDO FREI MONTALVA","ESCUELA BUENA ESPERANZA","COMPLEJO EDUCACIONAL MONSEÑOR FRCO. VALDES S","ESCUELA ELENA ARMIJO MORALES","COLEGIO ALESSANDRI","ESCUELA BASICA DALCAHUE","ESCUELA ALIRO LAMAS CASTILLO","ESCUELA BULI-CASERIO","COLEGIO JULIO SILVA LAZO","COMPL.EDUCACIONAL BRIGIDA WALKER ANEXO","COLEGIO BATALLA DE LA CONCEPCION","ESCUELA BERNARDINO MUNOZ GONZALEZ","ESC. BASICA JAVIERA CARRERA VERDUGO","COMPLEJO EDUCACIONAL CLARA SOLOVERA","COLEGIO EL TABO","LICEO SAN IGNACIO","ESCUELA BASICA SALVADOR ALLENDE","CENTRO EDUC.MUNIC. DR. AMADOR NECHME R.","ESCUELA BASICA PUENTE SIETE","ESCUELA ALLIPEN","ESCUELA BASICA ALEJANDRO NOEMI HUERTA","ESCUELA BASICA FRESIA","ESCUELA ARTURO ALESSANDRI PALMA","ESCUELA FUTALEUFU","ESCUELA BASICA JOSE M. BALMACEDA F.","ESC. BASICA FORTIN NIELOL","ESC.PRESBITERO JOSE AGUSTIN GOMEZ Z.","COLEGIO ANTONIO TRDAN ARKO","LICEO MELINKA","ESCUELA ADRIANA RIQUELME NUNEZ","ESC. MONSENOR MANUEL LARRAIN ERRAZURIZ","COLEGIO MAURICIO HITCHCOCK","COLEGIO BASICO VILLA ACERO","ESCUELA ALEJANDRO VARELA SANTA MARIA","ESCUELA PISAGUA","ESCUELA BASICA JOSE MIGUEL CARRERA","ESCUELA ADELAIDA LA FETRA","ESCUELA BASICA CAMILO HENRIQUEZ","ESCUELA DE PARVULOS ANTU-HUILEN","COLEGIO ESPANA","CENTRO DE EDUCACION MARIO BERTERO CEVASCO","COLEGIO BASICO LORENZO BAEZA VEGA","COLEGIO INSULAR ROBINSON CRUSOE","COLEGIO ANTU","COLEGIO BOLONIA","ESCUELA PROF. MONICA SILVA GOMEZ","COLEGIO ARTISTICO SOL DEL ILLIMANI","COLEGIO MUNICIPAL PROCERES DE CHILE","ESCUELA BASICA CARLOS CONDELL","COLEGIO LUIS CRUZ MARTINEZ","COLEGIO NERUDA","COLEGIO MUNICIPALIZADO CONFEDERAC SUIZA","COLEGIO ALTOVALSOL","COLEGIO DE CULTURA Y DIFUSION ARTISTICA","COMPLEJO EDUCACIONAL IGNAO","ESCUELA AMANDA LABARCA","ESCUELA BASICA CACIQUE COLIN","ESCUELA ALBERTO CORDOVA LATORRE","COLEGIO INES DE SUAREZ","COLEGIO LEONARDO DA VINCI DE LAS CONDES","ESC. BASICA AMELIA GODOY","ESCUELA ARTURO EBENSPERGER RICHTER","COLEGIO DR. MANUEL AVILES INOSTROZA","ESCUELA BASICA BRASILIA","ESCUELA ALEJANDRO GIDI","ESCUELA CARDENAL RAUL SILVA HENRIQUEZ","ESCUELA AGUSTIN EDWARDS","ESCUELA BASICA GABRIELA MISTRAL","ESCUELA DE ED.DIFERENCIAL LO BARNECHEA","COLEGIO HERNAN OLGUIN","COMPLEJO EDUCACIONAL PEDRO PRADO","ESCUELA BASICA GALVARINO VALENZUELA MORAGA","ESCUELA ALBORADA","ESCUELA ANGEL CRUCHAGA SANTA MARIA","ESCUELA BÁSICA BERNARDO ÑANKO","ESCUELA CLAUDIO FLORES SOTO","ESCUELA BASICA GRAL.JOSE MIGUEL CARRERA","ESCUELA ARTURO ALESSANDRI PALMA","ESCUELA FRANCIA","COLEGIO DE DIFUSION ARTISTICA LOS ULMOS","ESCUELA BASICA VILLA TRINTE","COLEGIO DIEGO DE ALMAGRO","COLEGIO ANGEL DE PEREDO","ESCUELA BASICA REPUBLICA DE ITALIA","COLEGIO BELLAVISTA","ESCUELA BAS. CENTRO EDUCACIONAL MILLANTU","ESCUELA ALABAMA","COLEGIO ALCAZAR","ESC.ALCIDES REYES FRIAS","ESCUELA MUNICIPAL AMERICA","ESCUELA ARTURO PEREZ CANTO","ESCUELA BASICA F-N¦ 732 CHOROMBO ALTO","COLEGIO SAN JOSE","ESCUELA CALLEJONES","ESCUELA ENCARNACION OLIVARES","ESCUELA BASICA JULIA HERRERA VARAS","ESCUELA BASICA VOLCAN LLAIMA","COLEGIO HUILCO ALTO","ESC.INTERN.LAS PALMAS TRES ESQUINAS","COLEGIO BASICO RENACER DE CERRILLOS","COLEGIO ANDRES BELLO","ESCUELA BASICA MULCHEN","ESCUELA BASICA DOLLINCO","COLEGIO BASICO CONSOLIDADO","ESC. DE CONCENTRACION FRONTERIZA DOROTEA","COLEGIO MUNICIPAL DIVINA GABRIELA","ESCUELA BASICA RIHUE","ESCUELA BASICA EL RINCON","ESCUELA BASICA EL MELON","ESC. BASICA CHIVILCOYAN","ESCUELA PIONEROS DEL SUR","COL.MARIA VILLALOBOS ARTEAGA","ESCUELA ATENAS","ESCUELA CARLOS CONDELL","COLEGIO DE ADMINISTRACION Y COMERCIO EL INGENIO","ESCUELA CRISTAL CHILE","ESCUELA CHAPOD","ESCUELA GABRIELA MISTRAL","ESCUELA NUEVA AURORA","COLEGIO CHALLAY","ESCUELA ROBERTO WHITE GESELL","ESCUELA JORGE ERRAZURIZ ECHEÑIQUE","CENTRO EDUCATIVO FERNANDO SANTIVAN","ESCUELA BASICA FRAY CAMILO HENRIQUEZ","ESCUELA PAPUDO","ESC.BASICA MERCEDES URZUA DIAZ","ESCUELA ARMANDO GUZMAN MORALES","ESCUELA BASICA G-N¦673 PELVIN SAN FRANCISCO DE ASIS","CENTRO EDUC. VALLE HERMOSO","COLEGIO PARQUE LAS AMERICAS","ESCUELA EL MANZANO","ESCUELA BENITO MANCILLA PEREZ","ESCUELA ARTURO MATTE ALESSANDRI","COMPLEJO EDUCACIONAL PENCAHUE","ESCUELA ALMIRANTE JORGE MONTT -LVAREZ","COLEGIO BASICO VIOLETA PARRA SANDOVAL","ESCUELA EDUARDO FREI MONTALVA","ESCUELA BASICA LOS ALAMOS EL SOBRANTE","ESCUELA BASICA ANTONIO DE ZUNIGA","ESC. MATILLA DE NUEVA EXTREMADURA","ESCUELA AMELIA LYNCH DE LYON","COLEGIO LIBERTADORES","ESCUELA BASICA JUAN JORGE","ESCUELA BASICA G-841 SANTOS RUBIO MORALES","ESCUELA JUAN BTA. CHESTA CH.","ESCUELA BASICA RAUL CACERES PACHECO","ESCUELA LOMAS DE CHUDAL","ESCUELA LIBERTADOR BDO. O¦HIGGINS R.","ESCUELA BASICA FUERTE BAQUEDANO","ESCUELA CERRO SOMBRERO","ESC. DE PARV. MADRE BERNARDA MORIN DE PROVIDE","COLEGIO GENERAL JOSE VELASQUEZ BORQUEZ","ESC. BASICA CARILEUFU","COLEGIO FINLANDIA","CENTRO EDUCACIONAL NUEVA CREACION","COLEGIO DARIO SALAS","ESCUELA ALBERTO HURTADO","COLEGIO MIRADOR DEL LAGO","ESCUELA MUNICIPAL DE NILAHUE CORNEJO","ESCUELA BELGICA","ESC. CAPITAN ARTURO PRAT CHACON","ESCUELA PUQUELDON","ESC. BASICA CAUPOLICAN","COLEGIO CRECER","CTRO.APOYO A LA EDUC.ESPEC.DE PUTAENDO","LICEO GRANADEROS","ESCUELA ENTRE LAGOS","ESCUELA CHILHUE","ESCUELA ALLA-KINTUY","ESCUELA BASICA MIL PAISAJES-QUEMCHI","ESCUELA BASICA LONCOPANGUE","ESC. BAS.MUNICIPAL MERCEDES FONTECILLA","ESCUELA BASICA VILLA MERCEDES","ESCUELA BÁSICA AMANDA CH-VEZ NAVARRETE","COLEGIO VALLE DE QUILLOTA","COLEGIO CAPITAN IGNACIO CARRERA PINTO","ESCUELA RURAL LOS PINOS","COLEGIO RA+L RAM-REZ MAYOL","ESCUELA ABATE MOLINA","COLEGIO COSTA MAUCO","ESCUELA EL LLANO","COL. JOSE A. MANSO DE VELASCO Y S.","ESCUELA BASICA AMERICA","ESCUELA EL PLUMERO","CENTRO EDUC.ESCRITORES DE CHILE","ESCUELA BASICA LOS NOGALES","ESC. BASICA MONSERRAT ROBERT DE GARCIA","COLEGIO MANUEL FRANCISCO CORREA","COL.EDUC. ESPECIAL DR. ALBERT SCHWEITZER","COLEGIO AJIAL","ESCUELA BASICA EMIGDIO GALDAMES ROBLES","ESCUELA BASICA PATRICIO LYNCH","ESCUELA BASICA JUAN LUIS SANFUENTES ANDONAEGUI","COLEGIO PICHASCA","ESCUELA AONIKENK","COLEGIO RIACHUELO","BERNARDO DE BRUYNE","ESCUELA AMERICA LATINA","ESC. BASICA ANTONIO LADINO","ESC.DE EDUC.GRAL. BASICA MONSENOR ENRIQUE COR","ESCUELA BASICA BERTA HIDALGO BARAHONA","COLEGIO ESPANA","CENTRO EDUC. PADRE ALBERTO HURTADO DE SAN BER","ESCUELA AGUA BUENA","ESCUELA AURORA","ESC. BASICA SILVIO ZENTENO VERGARA","ESCUELA BASICA PASO ANCHO","ESCUELA 21 DE MAYO","COLEGIO GIUSEPPE BERTOLUZZI DE FELIP","ESCUELA PUNTA DELGADA","COLEGIO POLITECNICO VICTOR JARA","ESCUELA BERNARDO OHIGGINS","CENTRO EDUC. PROVINCIA DE ÑUBLE","ESCUELA BASICA F-N¦629 DE CONCENTRACION FRONTERIZA","ESCUELA RURAL PUAUCHO","ESCUELA BASICA MUNICIPAL","ESCUELA BASICA EL PEUMO","ESCUEAL RURAL QUILEN","ESCUELA BASICA G-N¦126","COMPLEJO EDUCACIONAL TOCONAO","BASICA SARGENTO CANDELARIA PEREZ","ESCUELA ALTO PANGUE","ESCUELA BASICA ALIVEN","LICEO ISIDORA AGUIRRE TUPPER","CENTRO EDUC. REQUEGUA","ESCUELA BÁSICA CACIQUE LEVI-N","ESC. MUNICIPAL LA LAJUELA","ESCUELA CHACAYAL","ESCUELA BASICA AURORA VELASCO PEREZ","CIUDAD SANTIAGO DE CHILE","COLEGIO PEOPLE HELP PEOPLE","ESCUELA CARACOLES","ESCUELA ALBORADA DE TALAGANTE","ESCUELA ANTUPEHUEN","ARTURO PRAT CHACON","ESCUELA ALONDRA ROJAS BARRIOS","COLEGIO MUNDO MAGICO","ESC. MANUEL RODRIGUEZ ERDOIZA","ESCUELA HORIZONTES","ESC. BASICA MARTA EMILIANA AGUILAR ZERON","ESCUELA BASICA G-N¦ 346","ESCUELA ANA MOLINA","ESCUELA ARTURO PRAT CHACON","ESCUELA AGUAS Y GAVIOTAS","ESCUELA BÁSICA LISA ENRIQUETA PETER TEUBNER","ESCUELA MUNICIPAL CDTE LUIS BRAVO BRAVO","ESCUELA BASICA EMILIA ROMAGNA","ESCUELA BÁSICA VALLE LONQU+N","ESCUELA ALEJANDRO PEREZ URBANO","COLEGIO DEPORTIVO MUNICIPAL DE VALDIVIA","ESC.BASICA CAPITAN RAFAEL TORREBLANCA","CENTRO EDUCATIVO FLORIDA","ESCUELA EMA CORNEJO DE CARDOEN","COLEGIO IGNACIO CARRERA PINTO","COLEGIO JOAQUIN VICUÑA LARRAIN","COLEGIO MIRAFLORES","COLEGIO AMERICA","ESCUELA ALCALDE MANUEL SALVADOR DEL C.","COLEGIO CHARLES DARWIN","ESCUELA ALEXANDER GRAHAM BELL","COLEGIO ANTARTICA CHILENA","ESCUELA JORGE SALGADO PICA","ESCUELA DIEGO PORTALES PALAZUELOS","ESCUELA BASICA RANCHILLOS","ESCUELA BASICA MERCEDES MATURANA GALLARDO"]
[null,null,null,null,null,"Comuna",null,null,null,{"$f":"VLOOKUP(G3,Hoja4!$D$2:$F$2763,3,FALSE)","v":{"$error":"#N/A"}},null,null,null,null,null,null,null,null,null,"ALGARROBO",null,"ESCUELA AYSEN","ESCUELA BASICA RURAL EL YECO","ESCUELA EL ASIENTO","ESCUELA CALLAQUI","ESCUELA FRONTERIZA","ESC ESP DE LENGUAJE OASIS DEL SABER","ESCUELA FATIMA","ESCUELA LUIS CRUZ MARTINEZ","ESC. BASICA MANUEL RODRIGUEZ","ESCUELA ARMANDO CARRERA GONZALEZ","ESCUELA VOLCAN ANTUCO","ESCUELA BÁSICA MARE NOSTRUM","COLEGIO INTEGRADO EDUARDO FREI MONTALVA","ESCUELA BASICA G-N¦813 LOS AROMOS DE EL RECURSO","ESCUELA BASICA PUEBLO SECO SANTA CLARA","ESCUELA BASICA LA VINA",null,"ESCUELA BASICA ENRIQUE ZANARTU PRIETO","ESCUELA BÁSICA HOMERO VIGUERAS ARANEDA","ESCUELA DE PARVULOS INTI PANNI","ESCUELA JOSE MANUEL BALMACEDA","ESCUELA MANUEL ORELLA ECHANEZ","ESCUELA BASICA EL LIBERTADOR","LICEO LONQUEN","ESCUELA BASICA LA PAMPILLA","ESCUELA BASICA CANELA ALTA","ESCUELA BASICA NEHUENTUE","ESCUELA CARMEN ROMERO AGUIRRE","ESCUELA BASICA LAGUNILLAS","ESCUELA DIFERENCIAL `ANTU- KAU`","ESCUELA BASICA LOS CERRILLOS","ESCUELA ADOLFO QUIROZ HERNANDEZ","ESCUELA BASICA PEDRO AGUIRRE CERDA","COMPLEJO EDUCACIONAL CERRO NAVIA","ESCUELA BASICA ANGELINA SALAS OLIVARES","ESCUELA RURAL AYACARA","ESCUELA LOANCO","COLEGIO LIBERTADOR O¦HIGGINS DE CHEPICA","ESCUELA BASICA JOHN F. KENNEDY","ESCUELA BASICA DE CHILE CHICO","ESCUELA 27 DE ABRIL","ESCUELA BASICA NEBUCO","ESCUELA BAS. JOSE MIGUEL CARRERA VERDUGO","ESCUELA BASICA COIHUE CURACO","ESCUELA DE EDUCACION ESPECIAL AMANECER","ESCUELA GUIDO GOMEZ MUNOZ","ESCUELA REINO DE SUECIA","ESCUELA RURAL RIO PUELO",null,"COLEGIO MARIANO LATORRE","ESCUELA FELIPE CUBILLOS SIGAL","ESCUELA JOSE ANTOLIN SILVA ORMENO","ESCUELA BRITANICA GUILLERMINA DRAKE WOOD","ESCUELA MUNICIPAL CHILLEHUE","ESCUELA BASICA DE COLBUN",null,"ESC. ESPECIAL ELSA MATILDE ULRICH JARA","ESCUELA BASICA VICTOR DURAN PEREZ","COLEGIO QUILLAYQUEN RINCONADA DE PARRAL","ESCUELA BASICA ARTURO PEREZ CANTO","COLEGIO BIOBÍO","ESCUELA ALLIPEN","ESCUELA BASICA PUENTE COLMO","ESCUELA COSTA BLANCA","ESCUELA SAN LUIS DE CONTULMO","ESC.EDUC.DIFERENCIAL MARIA LUZ LANZA PIZARRO","COLEGIO PABLO NERUDA","ESCUELA AMBROSIO O¦HIGGINS","ESCUELA RURAL CHAIHUIN","ESCUELA BASICA LAS HORTENCIAS","ESCUELA LUIS CRUZ MARTINEZ","ESCUELA BASICA VALLE DE PUANGUE","ESCUELA RURAL HUYAR ALTO","ESCUELA COLICO NORTE","ESCUELA EL SANTILLO","ESCUELA FRAY PEDRO ARMENGOL VALENZUELA","COLEGIO EL BOLDO","ESCUELA RURAL JUAN VICTORINO TANGOL","ESCUELA BASICA SARA CORTES CORTES","ESCUELA CHACAY","COLEGIO MUNICIPAL LA ISLA","ESC.PRESIDENTE EDUARDO FREI MONTALVA","COMPLEJO EDUCACIONAL FELIPE HERRERA LANE","ESCUELA DE SAN VICENTE ALTO","ESCUELA CHINIGUE EL CRISTO","ESCUELA EL TOTORAL","ESCUELA BASICA LAS CRUCES",null,"ESCUELA BASICA TEMOCUICUI","ESCUELA ARNALDO FALABELLA","ESCUELA BASICA VILLAMAVIDA","ESCUELA ARMANDO QUINTULEN","ESCUELA DE MAITENCILLO","ESCUELA RURAL SAN ANDRES","ESCUELA BERNARDO PHILIPPI",null,"ESCUELA DE PARVULOS LOS PUMITAS","ESCUELA BASICA DE EL CAPRICHO","ESCUELA BASICA CINCO","COLEGIO MAR-A ESCOBILLANA GUZM-N",null,"ESCUELA ANA JESUS IBACACHE","ESCUELA AMELIA VIAL DE CONCHA","ESCUELA ANTUPIREN","ESCUELA ALONKURA","ESCUELA BASICA LOS LIBERTADORES","LICEO DE HUARA","ESCUELA EL OLIVAR","ESCUELA BÁSICA N¦2442 `CENTRO EDUCACIONAL ERNESTO YAÑEZ RIVERA`","ESCUELA BASICA CLEMENCIA VILLARROEL","ESCUELA LUIS GALDAMES","COLEGIO REPUBLICA DE CROACIA","ESC.BASICA SAN ANTONIO DE NALTAGUA",null,null,"COLEGIO NACIONES UNIDAS","COLEGIO DOMINGO SANTA CRUZ WILSON",null,"COLEGIO CAPITAN PASTENE","ESCUELA BAS. BENJAMIN SUBERCASEAUX","ESCUELA BASICA PEDRO PABLO MUNOZ","ESCUELA COMUNIDADES DE VALLE HERMOSO","COLEGIO SIMON BOLIVAR","COLEGIO SAN CONSTANTINO","COLEGIO ARTURO PRAT CHACON","ESC.DIFERENC.VILLA SAN JOSE DE LA UNION","ESCUELA RURAL RININAHUE","ESCUELA ANDRES ALCAZAR","ESCUELA BASICA F - N¦372 SANTA SARA","ESCUELA FELIPE BARTHOU CORBEAUX","ESC. CONTRAMAESTRE CONSTANTINO MICALVI","COLEGIO SAN FRANCISCO DEL ALBA","ESC. BASICA GUACOLDA","ESCUELA BOCA LEBU","ESCUELA ALEJANDRO ROJAS SIERRA","ESCUELA BASICA HEROES DE CHILE","ESCUELA BASICA ESPANA","ESCUELA MUNICIPAL PULIN","ESCUELA BASICA EL PORVENIR","ESCUELA INES GALLARDO ALVARADO","ESCUELA DE FARELLONES","ESCUELA BASICA","ESC.DE EDUCACION DIFERENCIAL QUILLAHUE","ESCUELA OCTAVIO MUJICA VALENZUELA","ESCUELA ARAUCARIAS","ESCUELA ANSELMO DEL CARMEN TAPIA LOYOLA","ESCUELA BASICA MALALMAHUIDA","ESCUELA FELIX EYHERAMENDY","ESCUELA BASICA RIO BLANCO","ESCUELA BÁSICA ESPERANZA","ESCUELA NEVADA","COLEGIO INGL+S MABEL CONDEMAR-N","ESCUELA GUSTAVO VASQUEZ DIAZ","ESCUELA BASICA ERCOLE BENCINI","ESCUELA BÁSICA CARABINERO ISA-AS GUEVARA","ESCUELA F-174 VALLE DE LUMACO","COLEGIO GABRIELA MISTRAL","ESCUELA BASICA","LICEO GABRIELA MISTRAL","COLEGIO MUNIC. SAN SEBASTIAN DE RINCONADA","ESCUELA MUNICIPAL DE CORCOLEN","ESCUELA MUNICIPAL PAILIMO",null,"ESCUELA BASICA F-N¦738 LOS RULOS","ESC.RURAL JUAN POBLETE SAINT-SIMON","ESCUELA CHACARILLA","ESCUELA JOSE ABELARDO NUÑEZ",null,null,"COLEGIO LOS JAZMINES","ESCUELA BAJO LOS ROMEROS","COLEGIO RIO GRANDE","COLEGIO DEL CAMINO REAL","ESCUELA BASICA VILLA LAS PENAS","ESCUELA CANADA","ESCUELA BÁSICA PUQUILLAY","ESCUELA BAUDILIA AVENDANO DE YOUSSUF","ESCUELA BASICA CONFEDERACION HELVETICA","ESCUELA BASICA VAQUERIA","ESCUELA BASICA TALHUAN","ESCUELA BASICA LA PENA","ESC. BASICA LA ARAUCARIA",null,"ESCUELA MUNICIPAL DE GULTRO","ESCUELA BÁSICA QUEBRADA DE ALVARADO","ESCUELA CLAUDIO ARRAU","COLEGIO DE ARTES ELISEO VIDELA JORQUERA","ESCUELA LA ESPERANZA","ESCUELA CHOMIO","ESCUELA JERONIMO GODOY VILLANUEVA","ESCUELA OLEGARIO MORALES OLIVA","ESC. BASICA MUNICIPAL PAULA JARAQUEMADA ALQUI",null,"ESCUELA MUNICIPAL DE PALMILLA","COMPLEJO EDUCACIONAL TIERRA DE ESPERANZA","ESCUELA BASICA VINA ERRAZURIZ","ESCUELA RURAL PULLALLY","ESCUELA MUNICIPAL ALBERTINA VALENZUELA","ESCUELA ARRAU MENDEZ","ESCUELA DIFERENCIAL ALEGRIA DE VIVIR","CENTRO EDUCACION MARIANO EGANA","ESC. BASICA MUNICIPAL RISOPATRON","ESCUELA HERNAN CIUDAD INOSTROZA","ESCUELA GLADYS CANALES PAREDES","ESCUELA BASICA GENERAL CRUZ","ESCUELA CORINTO","ESCUELA ALMIRANTE PATRICIO LYNCH","COLEGIO MANUEL RODRIGUEZ ERDOIZA",null,"ESCUELA BASICA PEDEGUA","ESCUELA BASICA ROSARIO DE CODAO","ESCUELA SAN ANDRES DE PICA","ESCUELA BASICA JOSE BERNALES CASTILLO","ESCUELA DIGNA CAMILO","ESCUELA HECTOR MANUEL ARIAS CORTES","ESCUELA BASICA G-N¦643 SAN JUAN DE PIRQUE","ESCUELA LAS AMERICAS","ESCUELA DANY GERMAN GONZALEZ SOTO","LICEO NIBALDO SEPULVEDA FERNANDEZ",null,"ESCUELA BASICA LA HUAYCA",null,"ESCUELA ABELARDO ITURRIAGA JAMETT","COMPLEJO EDUCACIONAL SARGENTO ALDEA","ESC.BASICA PAILLACO","ESC.COMODORO ARTURO MERINO BENITEZ","ESCUELA ANDES DEL SUR","COLEGIO LOS ALERCES","ESCUELA RURAL ADMINISTRACION RUPANCO","COLEGIO NUEVA BRAUNAU","ESCUELA MUNICIPAL DE PUMANQUE","ESCUELA TERESITA DE LOS ANDES","ESCUELA DE PUERTO HARRIS","ESCUELA RURAL DETIF","ESCUELA ENZO FERRARI","ESCUELA BERTOLDO HOFMANN KAHLER","ESC. BAS. GASTON ORMAZABAL CABRERA",null,"ESCUELA PARVULARIA `RAYITO DE SOL`","ESCUELA RURAL ALVARO VARGAS MIRANDA","ESCUELA BASICA SECTOR ORIENTE","ESCUELA RURAL AQUELARRE","INSTITUTO VALLE DEL SOL QUILACO","ESCUELA BASICA ANA FRANK","LICEO FRANCISCO BASCUNAN GUERRERO","ESCUELA BÁSICA LAGUNA AVENDAÑO","ESCUELA BASICA ABEL GUERRERO AGUIRRE","COLEGIO FERNANDO DURAN VILLARREAL","ESCUELA RURAL METAHUE","ESCUELA AMPARO RAYO HORTA","ESCUELA ANGELMO","COLEGIO VALLE DE NARAU","ESCUELA GRUMETE CORTES","COLEGIO AURORA DE CHILE","ESCUELA BASICA ÑIPAS","ESCUELA LOS ALMENDROS","ESC.BAS.BILINGUE REPUBLICA DEL PARAGUAY","ESCUELA MUNICIP. LA NOBEL GABRIELA","ESC.MUNIC.DE PARVULOS HERNAN DEL SOL","COLEGIO MUNICIPAL DE APALTA","ESC. REPUBLICA DE FRANCIA","COLEGIO ROBINSON CABRERA BELTRAN","ESCUELA BASICA MANUEL LEON SALINAS","ESCUELA BASICA RIO BUENO","ESCUELA ODESSA","ESCUELA BASICA DE SERON",null,"ESCUELA ANDREW JACKSON",null,"ESCUELA ARTURO ALESSANDRI PALMA","ESC. BASICA AUGUSTO WINTER TAPIA","ESCUELA EUGENIO TAGLE VALDES","ESCUELA BASICA CHILLEPIN","EDUARDO FERNANDEZ DE ASTURIAS","CENTRO EDUCACIONAL BALDOMERO LILLO","ESCUELA BULI","ESCUELA BAJO LIRCAY","ESCUELA BÁSICA LIBERTAD","LICEO JORGE ALESSANDRI RODRIGUEZ","ESCUELA ALMENDRAL","COLEGIO HERMANO FERNANDO DE LA FUENTE",null,"ESCUELA BASICA PUEBLO SECO","ESCUELA GERONIMO LAGOS LISBOA","CENTRO EDUCACIONAL HORACIO ARAVENA A.","ESCUELA BASICA F-N¦632 EL CANELO",null,"ESCUELA ESPECIAL LOS CEDROS DEL LIBANO","ESCUELA BASICA LA LOMA","ESCUELA BASICA SAN PABLO","ESCUELA BASICA G-N¦128 ATALICIO AGUILAR A.","ESCUELA BASICA SAN BARTOLOME","COLEGIO GALVARINO DE LOMAS COLORADAS","ESCUELA EL MILAGRO","ESCUELA BASICA EDUCADORES DE CHILE",null,"ESC. ADRIANA ARANGUIZ CERDA","ESCUELA BÁSICA ENRIQUE BERNSTEIN CARABANTES","ESCUELA ANGEL ARRIGORRIAGA","ESCUELA DIEGO PORTALES","ESCUELA GUILLERMO BANADOS HONORATO","ESC. BAS. REPUBLICA ORIENTAL DE URUGUAY","ESCUELA BASICA CLAUDIO VICUNA","ESCUELA ESTACION BAQUEDANO","ESCUELA BASICA TEGUALDA","ESCUELA AURORA DE CHILE","COLEGIO BASICO LOS LOBOS","ESCUELA HOGAR VICTORIANO QUINTEROS SOTO","COMPLEJO EDUC. UN AMANECER EN LA ARAUCANIA","ESCUELA ALBORADA VENTANA DEL BAJO","ESCUELA NUEVA ALBORADA","ESCUELA AMOLANAS","ESCUELA BASICA G-N¦345 RUNGUE","ESCUELA CASA DE PIEDRA","ESCUELA CARLOS CONDELL DE LA HAZA","ESCUELA AMANECER DE VILLA LOS BOLDOS","ESCUELA BÁSICA REP+BLICA DE ECUADOR",null,"ESCUELA DIEGO PORTALES","ESCUELA ESPECIAL DE LENGUAJE SONRISAS","ESCUELA BASICA TUCAPEL","COLEGIO TENIENTE HERNAN MERINO CORREA","ESCUELA ARTURO PEREZ CANTO","COLEGIO PABLO NERUDA","ESCUELA ENTRE AGUAS DE LLICO","ESCUELA BASICA PATRICIO LINCH","ESCUELA AMELIA BARAHONA MUJICA","COLEGIO REPUBLICA DE COLOMBIA","COMPLEJO EDUCACIONAL LA GRANJA","ESCUELA ALCALDE ORLANDO RODRIGUEZ DEL C.","COLEGIO ITALO COMPOSTO SCARPATI","ESCUELA EPUKLEI","LICEO MUNICIPALIZADO AMANDA LABARCA","ESCUELA LUIS AMBROSIO CONCHA","ESCUELA ENRIQUE PUFFE KIND","ESCUELA FERNANDO BAQUEDANO","LICEO DE ZAPALLAR"]
[null,null,null,null,null,"Establecimiento",null,null,null,{"$f":"VLOOKUP(G4,Hoja4!$C$2:$E$2763,3,FALSE)","v":{"$error":"#N/A"}},null,null,null,null,null,0,null,"Padre",null,"ALHUE",null,"ESCUELA BASICA","ESCUELA DE PARVULOS LOS CLAVELES","ESCUELA HACIENDA ALHUE","ESCUELA DE CONCENTRACIÓN FRONTERIZA RALCO ALTO BIOBÍO","ESCUELA RICARDO CAMPILLAY CONTRERAS",null,"ESCUELA PUDETO","ESCUELA PATRICIO LYNCH","ESCUELA BASICA ARAGON","ESCUELA ARTURO PRAT","LICEO DOCTOR V-CTOR R-OS RUIZ","ESCUELA BASICA BRISAS DEL MAR","ESC. COMTE. JUAN JOSE SAN MARTIN","ESCUELA HUMBERTO MORENO RAMIREZ","ESCUELA BATALLA DEL ROBLE","ESCUELA BASICA MUNICIPAL ARAUCARIA",null,"ESCUELA CHARRUA","ESCUELA BASICA CACIQUE FRANCISCO MELIN","ESCUELA DE PARVULOS LAS ABEJITAS","ESCUELA LIBERTADOR GENERAL BERNARDO O¦HIGGINS RIQUELME","ESCUELA VILLA LAS PLAYAS","ESCUELA BASICA GABRIELA MISTRAL","LICEO MUNICIPAL POETISA GABRIELA MISTRAL","ESCUELA BASICA MARIA ISABEL DE BROWN","ESCUELA BASICA JUAN ANTONIO RIOS","ESCUELA DARIO SALAS DIAZ","ESCUELA PRESIDENTE AGUIRRE CERDA","ESCUELA DOMINGO ORTIZ DE ROZAS","ESCUELA INES MUNOZ DE GARCIA","ESCUELA BASICA SANTA MARGARITA","ESCUELA ANIBAL PINTO","ESCUELA CERRILLOS","ESCUELA ALIANZA","ESCUELA BASICA DIEGO PORTALES PALAZUELOS",null,"ESCUELA LOS HEROES","ESCUELA LUIS ARTURO ZUNIGA FUENTES","ESCUELA BASICA MANQUIMAVIDA",null,"ESCUELA ANTONIO MACHADO","ESCUELA BASICA RUCAPEQUEN","ESCUELA BAS. PEDRO ETCHEVERRY","LICEO JAMES MUNDELL","LICEO MANUEL JESUS ANDRADE BORQUEZ","ESCUELA HAMBURGO",null,null,null,"COLEGIO MUNICIPAL CRISTO DEL PARQUE","ESCUELA GUARILIHUE ALTO","ESCUELA NIEVES DEL SUR","ESCUELA DOMITILA URREJOLA MENCHACA","ESCUELA MUNICIPAL COPEQUEN","ESCUELA CARLOS DEL CAMPO RIVERA",null,"ESC.BASICA FRANCISCO PETRINOVIC KARLOVAC","ESCUELA BENJAMIN FRANKLIN","ESC. LUCILA GODOY ALCAYAGA","ESCUELA BASICA JUANITA FERNANDEZ SOLAR","COLEGIO ESPAÑA","ESCUELA ARAUCARIAS DE CHILE","ESCUELA ORO NEGRO","ESCUELA ENRIQUE DONN MULLER",null,"ESCUELA ABRAHAM SEPULVEDA PIZARRO","COLEGIO SANTA CECILIA","ESCUELA ARTURO HUGHES CERNA",null,"ESCUELA BASICA QUECHEREHUE","ESCUELA OSVALDO FUENTES BARRERA","ESCUELA ELIECER PEREZ VARGAS","ESCUELA RURAL SAN JAVIER","ESCUELA COLICO SUR","ESCUELA JERONIMO NECULPAN","ESCUELA GASPAR HERRERA HERRERA","COLEGIO POLIVALENTE JAPÓN","ESCUELA RURAL MALLINLEMU",null,"ESCUELA COLVINDO","COLEGIO REPUBLICA DE CHILE","ESCUELA AURORA DE CHILE","ESC. BAS. PDTE. SALVADOR ALLENDE G.","ESCUELA DEL CARMEN SAN MART-N OT-ROLA","ESCUELA EL REMANSO","ESCUELA POETA NERUDA DE ISLA NEGRA",null,null,"ESCUELA BASICA TEODOCIO URRUTIA","ESCUELA BÁSICA ARTURO ALESSANDRI PALMA","ESCUELA RAHUIL","ESCUELA COIPUE","ESCUELA EMILIA SCHWABE RUMOHR",null,"ESCUELA CLAUDIO MATTE",null,"ESCUELA FRONTERIZA DE LLIFEN","ESCUELA BASICA DE LA PIEDRA","ESCUELA BASICA LICARAYEN","ESCUELA MUNICIPAL DE TUNICHE",null,"ESCUELA BASICA BENJAMIN MATTE LARRAIN","ESCUELA LA HUERTA DE MATAQUITO","ESCUELA RURAL CATARATAS DEL ALERCE","ESCUELA BÁSICA CRISTÓBAL COLÓN","ESCUELA CARLOS ALBERTO FERN-NDEZ CASTILLO",null,"ESCUELA MIREYA ZULETA ASTUDILLO","ESCUELA BASICA CARLOS PRATS G.","ESCUELA BASICA GRACIELA DIAZ ALLENDE","ESCUELA NUEVA ZELANDIA","COLEGIO REPUBLICA DE ITALIA","ESCUELA BASICA EFRAIN MALDONADO TORRES",null,null,"COLEGIO PALESTINO","COLEGIO LEONARDO DA VINCI",null,"COLEGIO MARIA ELENA","ESCUELA BAS. LA ARAUCANIA",null,"ESCUELA DIEGO PORTALES","ESCUELA BASICA JUAN DE DIOS ALDEA","COMPLEJO EDUCACIONAL LA REINA","COLEGIO BERNARDA MORIN","ESCUELA EL MAITEN","LICEO ANTONIO VARAS","ESCUELA BASICA LA COLONIA","ESCUELA BASICA F-N¦371 SANTA ROSA DE LAMPA","LICEO REPUBLICA DEL BRASIL","ESCUELA BASICA ROMILIO ARELLANO TRONCOSO","LICEO JUAN PABLO II DE LAS CONDES","ESC. BASICA NUMERO SEIS","ESCUELA DR.ARNOLDO EBENSPERGER RICHTER","ESCUELA LOS COPIHUES","ESCUELA BASICA LOS MAITENES","ESCUELA ESPECIAL LAS VIOLETAS","ESCUELA MUNICIPAL QUELENTARO","ESCUELA ELISA LATTAPIAT VARGAS","ESCUELA RURAL COLEGUAL","INSTITUTO ESTADOS AMERICANOS LO BARNECHEA","ESCUELA BASICA ACAPULCO","ESCUELA BASICA N¦389 REPUBLICA DE ESTADOS UNIDOS",null,"ESCUELA DOMITILA PINNA PARRA","ESCUELA CARDENAL JOSE MARIA CARO","ESCUELA DE ICALMA","ESCUELA JOSE ULLOA FIERRO","ESCUELA EL SAUCE","ESCUELA BÁSICA HITILHUE","ESCUELA NUEVA COLLILELFU","ESCUELA RURAL CAÑITAS",null,"ESCUELA BASICA PABLO BARRIOLHET","ESCUELA BALDOMERO LILLO FIGUEROA",null,"COLEGIO JUAN TACHOIRE MOENA","ESCUELA JOSE BERNARDO SUAREZ",null,"ESCUELA BÁSICA 1737 LOS ALERCES DE MAIP+","ESCUELA MUNICIPAL DE LIMAHUE",null,null,"ESCUELA BASICA G-N¦733 CHOROMBO BAJO","ESCUELA FRAY BERNABE DE LUCERNA","ESCUELA COLIN","ESCUELA RURAL DORILA AGUILA AGUILAR",null,null,"COLEGIO MONS. JAIME LARRAIN BUNSTER","ESCUELA CASA BLANCA","ESC.CONCENTRACION FRONTERIZA DE TULAHUEN","ESC. DE PARV. LAURITA VICUNA","ESCUELA BLANCO ENCALADA","ESCUELA EL SABER","ESCUELA BAS. ADRIANA LYON VIAL","ESCUELA CAPITAN JUAN LADRILLERO","ESCUELA FRANCISCO CHAVEZ CIFUENTES","ESCUELA BASICA VILLA COIGUE","ESCUELA GLORIAS NAVALES","ESCUELA BASICA ULDA ARACENA GONZALEZ","ESC. BASICA SANTA MARIA DE BOROA",null,"ESCUELA NUESTRA SRA. DE LA MERCED","ESCUELA BASICA LO NARVAEZ","ESCUELA DE ARTES Y CULTURA OSORNO","COLEGIO FRAY JORGE","ESCUELA REPUBLICA ARGENTINA","ESCUELA COLPANAO","ESCUELA MARIO AQUILES RODRIGUEZ","ESCUELA PROYECTO DE FUTURO","ESCUELA ALEMANIA",null,"ESCUELA MUNICIPAL LIHUEIMO","ESCUELA BASICA REPUBLICA DE CHILE","ESCUELA EMA LOBOS REYES",null,"ESCUELA MUNICIPAL LO VALDIVIA","ESCUELA EL LIBERTADOR","ESCUELA EMILIA LASCAR","COLEGIO LIKANKURA DE PEÑALOL+N","ESCUELA BASICA RICARDO E. LATCHMAN","ESCUELA PABLO CORREA MONTT","ESCUELLA BLANCA BUSTOS CASTILLO","ESCUELA BASICA VALLE HERMOSO","ESCUELA OSVALDO HIRIART CORVALAN","ESCUELA BASICA FORJADORES DE CHILE","ESCUELA GUSTAVO RIVERA BUSTOS",null,"ESCUELA EDUARDO FREI MONTALVA","ESCUELA JUAN VALDES ORTUZAR","ESCUELA VERTIENTE DEL SABER","ESCUELA BASICA PATAGUAS CERRO","ESCUELA DIVINO MAESTRO","ESCUELA JAVIER JARPA SOTOMAYOR","ESCUELA BASICA G-N¦646 LO ARCAYA","ESCUELA UNION LATINOAMERICANA","ESCUELA EL AMANECER",null,null,"ESCUELA BASICA LA TIRANA",null,"ESCUELA BASICA JUAN PABLO DUARTE","ESCUELA BASICA EL RINCON","ESCUELA BASICA MUNICIPAL DE EL CLARO","ESCUELA ALBERT EINSTEIN","ESCUELA BASICA PADRE ALBERTO HURTADO","ESCUEAL RURAL CHAICAS","ESCUELA RURAL LAS CASCADAS","COLEGIO ROSITA NOVARO DE NOVARO PUERTO VARAS",null,null,"ESCUELA DELLAMIRA REBECA AGUILAR","ESCUELA RURAL ICHUAC","ESCUELA PEDRO DE ONA","ESCUELA PURRANQUE","ESCUELA ALEJANDRINA CARVAJAL ASPEE",null,"ESCUELA RURAL ARMANDO SCHEUCH EPPLE",null,"ESCUELA EDUCADORA EULOGIA BORQUEZ PEREZ","ESCUELA RURAL AUCAR",null,"ESCUELA BASICA EL MANIO","LICEO ISABEL RIQUELME","ESCUELA BÁSICA PUERTO LOS FRUTALES DE COYANCO","ESCUELA BASICA ARAUCO","COLEGIO JOSE MIGUEL INFANTE","ESCUELA RURAL SAN FRANCISCO","ESCUELA JAIME FELDMAN MILLER","ESCUELA ANTUMALAL","ESCUELA BASICA REPUBLICA DE FRANCIA","ESCUELA NUEVA AMERICA","COLEGIO BENJAMIN VICUÑA MACKENNA","ESCUELA BASICA NUEVA ALDEA","ESCUELA LUIS LEYTON RUBIO","ESCUELA ANNE ELEONOR ROOSEVELT","LICEO POLITECNICO DOMINGO STA MARIA","ESCUELA BASICA ISABEL LE BRUN","COLEGIO MUNICIPAL EL CERRILLO","ESCUELA BASICA CAMPO LINDO","ESCUELA COPIHUE","ESCUELA PERFECTO DE LA FUENTE DEL VILLAR","ESCUELA PAMPA RIOS","ESCUELA PORVENIR","ESCUELA SAMO ALTO",null,"ESCUELA RIO NEGRO",null,"ESCUELA CARLOS LAZCANO ALFONSO","ESCUELA BASICA BARTOLO LLANCALEO","ESCUELA JOSE CANEPA VACCAREZZA","ESCUELA BASICA DIAGUITAS DE CHALINGA","ESCUELA BASICA CERRO PLACILLA","COLEGIO JAIME GUZM-N ERRAZURIZ","ESCUELA CACHAPOAL","ESCUELA BAJO PERQUIN","ESCUELA EL COBRE",null,"ESCUELA BASICA BERNARDO O HIGGINS R.","ESCUELA ABRAHAM LINCOLN DE AGUA BUENA",null,"ESCUELA CALLE ALEGRE","ESCUELA IRENE MORALES","COLEGIO CIUDAD DE FRANKFORT","ESCUELA BASICA F-N¦638 EL MELOCOTON",null,"ESCUELA GENERAL BASICA SANTA FE","ESCUELA BASICA MONTELEON","ESCUELA DELICIO CARDENAS BUSTAMANTE","ESCUELA BASICA G-N¦130","ESCUELA BASICA SAN PEDRO DE ATACAMA","COLEGIO NUEVOS HORIZONTES","ESCUELA PANGUE ARRIBA","ESCUELA BASICA KARELMAPU",null,"ESC. ENRIQUE YANEZ GONZALEZ","ESCUELA BASICA MANIL","ESCUELA ESPECIAL DE SANTA CRUZ","ESCUELA RECAREDO VIGUERAS ARANEDA","ESCUELA JULIO TEJEDOR ZUNIGA","ESCUELA BÁSICA F N¦ 64","ESCUELA EL CONVENTO",null,"ESCUELA EL PINO VIEJO DE LONQUEN","ESCUELA BASICA PUERTAS NEGRAS","COLEGIO BASICO NUEVA LOS LOBOS","ESCUELA VICTOR CARVAJAL MEZA","ESCUELA ALONSO DE ERCILLA","ESCUELA COMALLE","LICEO MUNICIPAL BARROS ARANA","ESCUELA DE CONCENTRACION","ESCUELA BASICA G-N¦352 PLAZUELA DE POLPAICO","ESCUELA CHACUIVI","ESCUELA ESTADOS UNIDOS DE NORTEAMERICA","ESCUELA EL SEMBRADOR","ESCUELA BASICA ARTURO PRAT",null,"ESCUELA ESPECIAL LAS LILAS DE TRAIGUEN",null,"ESCUELA LOS AVELLANOS","ESCUELA ALEMANIA","ESCUELA BASICA ESPANA","COLEGIO PEDRO MONTT","ESCUELA LAGO VICHUQUEN","ESCUELA BASICA SANTA ELENA","ESCUELA BASICA LUCILA GODOY ALCAYAGA","ESCUELA ALMIRANTE LUIS GOMEZ CARRENO","ESC. BASICA VEGA REDONDA","ESCUELA ALCALDE SERAFIN GUTIERREZ F.","ESCUELA BASICA CATALUNYA","ESCUELA JOSE ABELARDO NUNEZ",null,"ESCUELA MAITENCILLO","ESCUELA H+ROES DE CHILE","ESCUELA LOS MAYOS"]
[null,null,null,null,null,null,null,null,null,null,null,null,null,null,null,1,null,"Madre",null,"ALTO BIOBIO",null,"ESCUELA BASICA RIBERA SUR",null,"ESCUELA SAN ALFONSO","ESCUELA RALCO LEPOY",null,null,"ESCUELA RURAL BAHIA LINAO",null,"ESCUELA BASICA NAHUELBUTA","ESCUELA CLAUDIO MATTE PEREZ",null,"ESCUELA BASICA CESAR MONSALVE FLORES","ESC. GRAL. PEDRO LAGOS MARCHANT","ESCUELA LO SALINAS","ESCUELA CANTA RANA","ESCUELA BASICA SAN LORENZO",null,"ESCUELA COLICHEU","ESCUELA BASICA FEDERICO GANA","ESCUELA DE PARVULOS LLAMITO BLANCO","ESCUELA RURAL AGUANTAO",null,"ESCUELA BASICA IRMA SAPIAIN",null,"ESCUELA BASICA VALLE ALEGRE",null,"ESCUELA ESPECIAL ARCO IRIS","LICEO EUGENIA SUBERCASEAUX","ESCUELA MANUEL BRAVO REYES","ESCUELA LUIS URIBE DIAZ","ESCUELA EL COBRE","ESCUELA ARTISTICA BARRIO ESTACION","ESCUELA ESTRELLA REINA DE CHILE","ESCUELA BASICA PAULO FREIRE","ESCUELA BASICA GASPAR CABRALES",null,"ESCUELA PAHUIL","ESCUELA LUZ MARIA CRESPO URETA DE KERESTEGIAN","ESCUELA BASICA REPUBLICA DE GRECIA",null,"ESCUELA ARTURO MERINO BENITEZ","ESCUELA TOMAS LAGO","ESCUELA BAS. VILLA CONVENTO VIEJO",null,null,null,null,null,null,"COLEGIO MUNICIPAL DE CALLEJONES","ESCUELA JOSE FRANCISCO PINO MEDINA","ESCUELA PEDRO QUINTANA MANSILA","ESCUELA GENERAL PEDRO LAGOS MARCHANT","ESCUELA MUNICIPAL EL RULO","ESCUELA KURT MOLLER BOCHERENS",null,"ESCUELA BASICA ALGARROBAL","ESCUELA ESPECIAL ERICO HORNUNG","ESC. SUBTENIENTE JULIO MONTT SALAMANCA","ESCUELA BASICA PEDRO DE VALDIVIA","COLEGIO GRAN BRETAÑA","ESCUELA ATENEA",null,"ESCUELA LAS CORRIENTES",null,"ESCUELA BERNARDO O HIGGINS","ESCUELA BASICA DAVID LEON TAPIA","ESCUELA BASICA JAVIERA CARRERA",null,"ESCUELA VIDA Y PAZ","ESCUELA PATRICIO CHAVEZ SOTO","ESCUELA FERNANDO CARVAJAL PINTO","LICEO ALFREDO DEL CARMEN BARRIA OYARZUN","ESCUELA DE LENGUAJE RAYEN-ANTU","ESCUELA LICANCURA","ESCUELA PEDRO ANTONIO GONZALEZ","COLEGIO RAUQUEN CAMPO",null,null,"ESCUELA NIQUEN","ESC. DE PARVULOS MIS PRIMEROS PASOS","ESCUELA BENJAMIN CLARO VELASCO","ESCUELA BASICA AVIADORES","ESCUELA ELISE MOTTART","ESCUELA REPUBLICA DE HONDURAS",null,null,null,"ESCUELA CHACAIMAPU","ESCUELA BÁSICA HUMBERTO VALENZUELA GARC-A","LICEO INES ENRIQUEZ FRODDEN","ESCUELA JUAN SEGUEL",null,null,"ESCUELA RURAL LOS LINARES DE CASMA",null,"ESCUELA RURAL CURRINE","ESCUELA BASICA MANIUCO","ESCUELA BASICA LOS PERALES","ESCUELA MUNICIPAL VILLA LA COMPANIA",null,"ESCUELA BASICA LA SOMBRA",null,"ESCUELA RURAL N.745 SEMILLERO","ESCUELA BLANCA ESTELA PRAT CARVAJAL","ESCUELA MANUEL AMAT Y JUNIET",null,null,"ESCUELA LAS CANTERAS","ESCUELA BASICA LAS PALMERAS DE LIMAHUIDA","LICEO POLIVALENTE A80 PRESIDENTE JOSE MANUEL BALMACEDA","ESC.EDUC.ESPECIAL FLOR DEL INCA","ESCUELA BASICA FUTURO LAS MERCEDES",null,null,"ESCUELA BAS. OSCAR ENCALADA YOVANOVICH","COLEGIO MARIA ALONSO CHACON",null,"ESCUELA BASICA LOS NAVIOS","ESCUELA BAS. LOS HEROES DE YUNGAY",null,"ESCUELA GABRIELA MISTRAL","ESCUELA CAPITAN AVALOS","ESCUELA D-231 ESPECIAL DE DESARROLLO","COLEGIO CALETA SAN PEDRO","ESCUELA ESPECIAL DE LENGUAJE MUNICIPAL",null,"ESCUELA FRANCISCO PEDRO ZATTERA GUELFI","ESCUELA BASICA G-N¦373 EL LUCERO",null,"ESCUELA MUNICIPAL DE LOS AROMOS","LICEO SANTA MARIA DE LAS CONDES","ESC. BASICA VEGA LARGA","ESCUELA ESPECIAL JUAN SANDOVAL CARRASCO","LICEO AUGUSTO SANTELICES VALENZUELA","ESCUELA COEDUC TTE HERNAN MERINO CORREA","ESCUELA GRACIELA LETELIER",null,"ESCUELA HERMINIA ORTEGA DE CROXATO","ESCUELA RURAL LOS PELLINES",null,"ESCUELA BASICA BERNARDO O¦HIGGINS","ESCUELA GOLDA MEIR",null,"ESCUELA EGON ERNTS KEUTMANN BESGEN","ESCUELA CARLOS MONTERO JARAMILLO","ESCUELA DE LIUCURA","ESCUELA LAS DUNAS","ESCUELA ESPANA","ESCUELA BÁSICA LA RINCONADA DEL SALTO","ESCUELA NUEVA ESPANA","ESCUELA RURAL EL MELI",null,"ESCUELA BASICA TERESA CANNON DE B.","ESCUELA BASICA BELLO HORIZONTE",null,"COLEGIO LOS LLANOS","ESCUELA JULIO MONTT SALAMANCA",null,"ESCUELA BÁSICA MUNICIPAL SAN LUIS","ESCUELA MUNICIPAL DE PANQUEHUE",null,null,"ESCUELA BASICA G-N¦734 LAS MERCEDES","ESCUELA RURAL ALFONSO OSSES PEREZ","ESCUELA EL CANELO","ESCUELA RURAL FRANCISCO CORTES OJEDA",null,null,"COLEGIO POMAIRE","ESCUELA EL PROGRESO","ESCUELA ALEJANDRO CHELEN ROJAS","ESC. HIJOS DEL SOL","ESCUELA IGNACIO VERDUGO CAVADA","ESCUELA NACIMIENTO DE NUESTRO SEÑOR","ESCUELA MUNICIPAL DE CUNACO","ESCUELA CORONEL SANTIAGO BUERAS",null,"LICEO POLIVALENTE LA FRONTERA","ESCUELA ROSARIO CHACON BARRIOS","LICEO MUNICIPAL JUAN RUSQUE PORTAL","ESC. ESP.RET.MENTAL AVANCEMOS JUNTOS",null,null,"ESCUELA ESPECIAL HELLEN KELLER","ESCUELA EFRAIN CAMPANA SILVA","COLEGIO YUNGAY","LICEO PAUL HARRIS","ESCUELA DARIO SALAS","ESCUELA MUNICIPAL CIELO CLARO--PAIHUANO","ESCUELA ROBERTO OJEDA TORRES","ESCUELA BARBARA KAST RIST",null,"ESCUELA MUNICIPAL SANTA MATILDE","ESCUELA CLAUDIO ARRAU LEON","ESCUELA INDEPENDENCIA",null,"ESCUELA MUNICIPAL SAN PEDRO DE ALCANTARA","ESCUELA FRANCISCO MAUREIRA","ESCUELA MALLOCO","ESCUELA CARLOS HERNANDEZ PENA","ESCUELA BOROA","LICEO DE PELARCO","LICEO PELLUHUE","ESCUELA DAFNE ELVIRA ZAPATA ROZAS","ESCUELA PADRE LUIS OLIVA NAVARRETE","ESCUELA BASICA LOS CONQUISTADORES",null,null,"ESCUELA FERNANDO GARCIA OLDINI","ESCUELA MUNICIPAL ALCALDE G. BURMESTER",null,"ESCUELA BASICA SAN JOSE","ESCUELA PUEBLO DE VIUDAS","ESCUELA JOSE TOHA SOLDEVILLA","LICEO EL PRINCIPAL","LICEO MUNICIPAL LA FRONTERA","ESCUELA MUNICIPAL LA DEHESA",null,null,"ESCUELA BASICA MAMINA",null,null,"ESCUELA BASICA LA LAGUNA","ESCUELA CARLOS HOLZAFEL","ESCUELA ALEXANDER GRAHAM BELL","ESCUELA CASAS VIEJAS","ESCUELA ALEMANIA","ESCUELA RURAL NOCHACO","ESCUELA DIFERENCIAL `ASPADEP`",null,null,"ESCUELA DIECIOCHO DE SEPTIEMBRE","ESCUELA RURAL LAS CAMPANAS",null,"ESCUELA RURAL LA PAZ","ESCUELA CATAN DABIKE",null,"ESCUELA RURAL ESTACION NUEVO PORVENIR",null,"ESCUELA RURAL ADELA GARCIA GARCIA","ESCUELA RURAL BORDEMAR VILLA MECHUQUE",null,"ESCUELA BÁSICA PUCARA LASANA",null,"ESCUELA BASICA EL CASINO","ESCUELA BASICA CANADA","ESC.CDTE. ELEUTERIO RAMIREZ MOLINA","ESCUELA RURAL TERESA CARDENAS DE PAREDES","LICEO REPUBLICA DE ITALIA","ESCUELA BASICA MUNICIPAL GRENOBLE","ESCUELA JUAN JOSE TORTEL",null,"COLEGIO ESPANA","ESCUELA BASICA SAN IGNACIO DE PALOMARES","ESCUELA RAUCO","ESCUELA ESCRITORA MARCELA PAZ",null,"ESCUELA BASICA LO VELASQUEZ","COLEGIO MUNICIPAL LA ESMERALDA","ESCUELA BERTA SAAVEDRA SEGURA","ESCUELA LOS ROBLES",null,"ESCUELA RURAL CARIMALLIN BAJO","LICEO AGROINDUSTRIAL RIO CLARO",null,null,null,null,"ESCUELA FRANCISCO DE PAULA SANTANDER","ESCUELA BASICA COLLICO RANCO","ESCUELA LA ISLA","ESCUELA BASICA GUISELA GAMBOA SALINAS","ESCUELA BASICA CUNCUMEN","ESCUELA ABRAHAM LINCOLN","ESCUELA EL CARBON","ESCUELA BELLA UNION","ESCUELA EL CORAZON",null,"ESCUELA BASICA CAROLINA OCAMPO GARCIA","ESCUELA BAS.ABEL BOUCHON FAURE",null,"ESCUELA COLTON VARIANTE","ESCUELA JOSE MANUEL BALMACEDA","ESC. BAS. Y ESP. SU SANTIDAD JUAN XXIII","ESCUELA BASICA G-N¦635 INTEGRADORA EL MANZANO",null,"ESCUELA LLANO SUBERCASEAUX","ESCUELA BASICA PUENTE EL ALA","ESCUELA RURAL JULIO MOHR SCHULER","ESCUELA BASICA G-N¦134 NIHUE",null,"ESCUELA BASICA BOCA DEL BIO BIO SUR","ESCUELA SAN RAFAEL","ESCUELA BASICA SENDERO DEL SABER",null,"ESC.CARMEN GALLEGOS DE ROBLE","ESCUELA BASICA VILLACURA","ESCUELA GRANJA ADEODATO GARCIA VALENZUELA",null,"ESCUELA LA HIGUERA","ESCUELA BAS SALVADOR SANFUENTES REP EEUU",null,null,"ESCUELA EL ROTO CHILENO","ESCUELA BRILLA EL SOL","COLEGIO BASICO SAN VICENTE",null,"ESCUELA ANDRES BELLO","ESCUELA HUEMUL",null,"ESCUELA LUIS URIBE ORREGO","LICEO HUERTOS FAMILIARES","ESCUELA ELOISA GONZALEZ","ESCUELA GABRIELA MISTRAL","ESCUELA RAYEN LAFQUEN QUEULE","ESCUELA BASICA BELLAVISTA",null,"ESCUELA REPUBLICA DE ISRAEL",null,"ESCUELA LUIS MART-NEZ GONZ-LEZ","ESCUELA ANGACHILLA","ESCUELA BASICA GUALBERTO KONG FERNANDEZ","ESC. ESPEC. DE DEF. MENTAL GRAN BRETA_A","LICEO NUEVO HORIZONTE","ESCUELA HEROES DE IQUIQUE","ESCUELA DAGOBERTO CAMPOS NUNEZ","ESCUELA ARTURO PRAT CHACON","ESCUELA DAGOBERTO GODOY","ESCUELA ALFREDO NOGUERA PRIETO","ESCUELA BASICA DIEGO BARROS ARANA","ESCUELA MANANTIAL",null,"ESCUELA SANTA ANA DE QUERI","ESCUELA MUNICIPAL CERRO PARRA","LICEO CAMPANARIO"]
[null,null,null,null,null,null,null,null,null,null,null,null,null,null,null,2,null,"Abuelo/a",null,"ALTO DEL CARMEN",null,"ESCUELA CARLOS CONDELL",null,"LICEO MUNICIPAL SARA TRONCOSO TRONCOSO",null,null,null,"ESCUELA RURAL EL PALOMAR",null,"ESCUELA DIEGO DUBLE URRUTIA","ESCUELA DARIO SALAS DIAZ",null,"ESCUELA BASICA SAN PEDRO DE LARAQUETE","ESC. HUMBERTO VALENZUELA GARCIA","ESCUELA LOS ROSALES DEL BAJO","ESCUELA CELIA URRUTIA PRIETO","ESCUELA BASICA VALLE DE ARTIFICIO",null,"ESCUELA EL MANZANO","ESCUELA BASICA JUAN AGUILERA JEREZ","ESCUELA DE PARVULOS LOS CONEJITOS","ESCUELA RURAL CHAUQUEAR",null,"ESCUELA BASICA JOSEFINA HUICI",null,"ESCUELA VICTOR KOERNER",null,"ESCUELA TRANAPUENTE",null,"ESCUELA SAN PEDRO DE QUINTAY","ESCUELA PADRE HURTADO","ESCUELA MARIA TERESA DEL CANTO","ESCUELA ESPECIAL HORIZONTE","ESCUELA J.PRIETO VIAL","ESCUELA CIUDAD SANTO DOMINGO DE GUZMAN","ESCUELA BASICA IGNACIO DOMEYKO",null,"ESCUELA SAN AMBROSIO","ESCUELA MARIA MARTA DEL REAL CORREA","ESCUELA BELGICA",null,"ESCUELA BÁSICA ROSITA O¦HIGGINS RIQUELME","LICEO POLIVALENTE JUAN PACHECO ALTAMIRANO","ESCUELA BAS.FERNANDO ARENAS ALMARZA",null,null,null,null,null,null,"COLEGIO SANTA TERESA DE TUNCA","ESCUELA MARIA TERESA MARCHANT CONTRERAS","ESCUELA RURAL CON INTERNADO RIO BLANCO","ESCUELA GUARDIA MARINA ERNESTO RIQUELME",null,"ESCUELA LA FLORESTA",null,"ESCUELA BASICA MARCOS GOOYCOLEA CORTES","ESCUELA MICHIGAN EL AMANECER","ESCUELA CAPITAN IGNACIO CARRERA PINTO",null,"COLEGIO JUAN GREGORIO LAS HERAS","ESCUELA BASICA LIKAN-ANTAI",null,"ESCUELA SANTA AURORA DE CARRIZAL",null,"ESCUELA BRUNO ZAVALA FREDES","ESCUELA BASICA MANUEL DE SALAS","ESCUELA BASICA PATAGUAL",null,"LICEO ARTURO VALENZUELA","LICEO LAS ARAUCARIAS","ESCUELA SAN JOSE OBRERO DE CURACAVI",null,"ESCUELA GABRIELA MISTRAL","ESCUELA RUCA MANKE",null,"ESC.REPUBLICA ORIENTAL DEL URUGUAY",null,null,"ESCUELA PUERTAS DE VIRGUIN","ESCUELA CERRILLOS","ESCUELA DE ED.DIFERENCIAL HELLEN KELLER","ESCUELA BASICA BASE EL BOSQUE","ESCUELA ESPECIAL DE LENGUAJE MUNICIPAL EL CARMEN","ESCUELA REPUBLICA DEL ECUADOR",null,null,null,"ESCUELA MILLALEVIA","ESCUELA BASICA",null,"ESCUELA LA ESPERANZA",null,null,"ESCUELA VICENTE PEREZ ROSALES",null,"ESCUELA RURAL ISLA HUAPI","ESCUELA MUNICIPAL DE LLUQUENTUE","LICEO JOSE VICTORINO LASTARRIA","ESCUELA SIXTO MENDEZ PARADA",null,"ESCUELA BASICA LOS TILOS DE HUALCAPO",null,null,"ESCUELA HELEN KELLER ADAMS","ESCUELA NUEVA REPUBLICA",null,null,"ESCUELA SANTA VICTORIA DE HUECHURABA","ESCUELA BASICA SAN RAFAEL DE ROZAS","LICEO SAN FRANCISCO DE QUITO","ESCUELA ALMIRANTE PATRICIO LYNCH","LICEO REPUBLICA DE ITALIA",null,null,"ESCUELA ESPERANZA JOVEN","ESCUELA BASICA",null,"ESCUELA BELLAVISTA","ESCUELA BAS. POETA OSCAR CASTRO ZUNIGA",null,"ESCUELA MINISTRO GOMEZ MILLAS","ESCUELA MUNICIPAL VIOLETA PARRA","ESCUELA PALESTINA","COLEGIO CARLOS CONDELL DE LA HAZA","ESCUELA LA UNION",null,"ESCUELA JOSE ABELARDO NUNEZ","ESCUELA MANUEL SEGOVIA MONTENEGRO",null,"ESCUELA MUNICIPAL MAESTRO JORGE LOPEZ OSORIO","LICEO SIMON BOLIVAR","ESCUELA DOLLICO ALTO","ESCUELA FRESIA GRACIELA MULLER RUIZ",null,"ESCUELA LIMACHITO","ESCUELA LAS HORNILLAS",null,"ESCUELA HEROES DE IQUIQUE",null,null,"ESCUELA BASICA CLARA ESTRELLA","ESCUELA IGNACIO CARRERA PINTO",null,null,"ESCUELA DE PARVULOS SEMILLITA","ESCUELA DE TROYO","ESCUELA ORLANDO DELGADO ZUNIGA","ESCUELA ESPECIAL VALLE ANDINO","ESCUELA BASICA 11 DE SEPTIEMBRE","ESCUELA RURAL ANTILHUE","ESCUELA RURAL ESTAQUILLA",null,"ESCUELA CLARA VIAL ORREGO","ESCUELA BASICA CENTENARIO",null,"ESC. SAN JUAQUIN DE LOS MAYOS","ESCUELA VILLA MACUL",null,"ESCUELA BÁSICA N 263 RAMON FREIRE","ESCUELA PELEQUEN",null,null,"ESCUELA BASICA G-N¦737 SANTA EMILIA","ESCUELA RURAL JOSE ARNOLDO BILBAO","ESCUELA MAULE","ESCUELA RURAL HILDA HUNQUEN",null,null,"ESCUELA BASICA CARMEN BAJO","ESCUELA PRESIDENTE EDUARDO FREI MONTALVA","ESCUELA BASICA LA VILLA","ESC. SAN FRANCISCO DE ASIS","ESCUELA SACERDOTE ALEJANDRO MANERA","ESCUELA OSCAR GUERRERO QUINSAC","ESCUELA MUNICIPAL YAQUIL","ESCUELA LIB. BERNARDO O¦HIGGINS R.",null,null,null,null,"ESCUELA ALEJANDRO GOROSTIAGA",null,null,"ESCUELA LA DORMIDA","ESCUELA ESPAÑA","ESC. HEBERTO VELAZQUEZ VELAZQUEZ",null,"ESCUELA FUNDO MAQUEHUE",null,"ESCUELA RURAL 21 DE MAYO","ESCUELA BASICA F-N¦835 HERMANOS SANCHEZ CERDA",null,"ESCUELA REBECA CADIZ VALENZUELA","ESCUELA MANUEL ANABALÓN S-EZ","ESCUELA JORGE BARROS BEAUCHEF",null,"ESCUELA MUNICIPAL VILLA SAN PEDRO","ESCUELA FRANCISCO PEREZ LAVIN","ESCUELA MAND EDUARDO FREI MONTALVA","ESCUELA E-180 MATILDE HUICI NAVAS","ESCUELA CENTRO EDUC. REP. MEXICANA",null,null,"ESCUELA JOS+ REN+ SALGADO","ESCUELA SANTA LAURA DE LO FIGUEROA","ESCUELA EDUARDO CAMBELL SAAVEDRA",null,null,"ESCUELA HOGAR FRONTERIZA DE CHALACO",null,null,"ESCUELA ENRIQUE SERRANO DE VIALE RIGO",null,"ESCUELA PUERTA DE LA CORDILLERA","LICEO MUNIC. TEC. PROF. EL LLANO",null,"ESCUELA MUNICIPAL LA TUNA",null,null,"ESCUELA BASICA POZO ALMONTE",null,null,"ESCUELA HORCON","ESCUELA MUNICIPAL LOS ARRAYANES","ESCUELA ANTILHUE DE PUDAHUEL","ESCUELA CONSOLIDADA","ESCUELA ALERCE HISTORICO",null,"ESCUELA GRUPO ESCOLAR",null,null,"ESCUELA ELBA OJEDA GOMEZ",null,null,"ESCUELA RURAL NUEVA ISRAEL","ESCUELA EDUARDO BECERRA BASCUNAN",null,"ESCUELA RURAL LOS PELLINES",null,"ESCUELA RURAL ARTISTICA ALUMNO MARCELO GUENTEO SOLIS","ESCUELA RURAL LLIUCO",null,"ESCUELA ESTADO DE MICHIGAN",null,"ESCUELA BASICA HEROES DEL ITATA","ESCUELA BASICA LA PALMA","ESCUELA BASICA DARIO SALAS","LICEO INSULAR","VIOLETA FUENTES CARVAJAL","ESCUELA BASICA REINO DE NORUEGA","ESCUELA MANTAGUA",null,"COLEGIO MANUEL ROJAS",null,null,"ESCUELA ESPANA",null,"ESCUELA CAPITAN JOSE LUIS ARANEDA","COLEGIO MUNICIPAL LO CARTAGENA","ESCUELA CANADA","ESCUELA MANUEL MONTT",null,"ESCUELA RURAL COLONIA DIUMEN",null,null,null,null,null,"ESCUELA GERARDO RODRIGUEZ ORTUZAR","ESCUELA RUCA RAQUI","ESCUELA LO VALDIVIA","ESCUELA BASICA JULIO ECHAVARRIA","ESCUELA BASICA EL ASILO","ESCUELA ALEMANIA","ESCUELA EL SAUCE","ESCUELA BRAMADERO","ESCUELA INCLUSIVA SAN LORENZO",null,"ESCUELA BASICA JOSE DE SAN MARTIN","ESCUELA BAS.SAN JOSE DE LOS LINGUES",null,"ESCUELA LAS QUILAS","ESCUELA JOSE MIGUEL CARRERA","ESCUELA BÁSICA POETA NERUDA (EX-483)","ESCUELA BASICA G-N¦636 SAN ALFONSO",null,"ESCUELA TERRITORIO ANTARTICO","ESCUELA SERGIO MARTIN ALAMOS","ESCUELA RURAL LA POZA","ESCUELA BASICA G-N¦139",null,"ESCUELA BASICA LUIS ALBERTO ACEVEDO",null,"ESCUELA BASICA TUPAHUE",null,"ESC.GUIDO ASSIS GONZALEZ","ESCUELA DE EDUCACIÓN GENERAL BÁSICA EL HUACHI","ESCUELA MARIA ARAYA VALDES",null,"ESCUELA MARIA ESPINOLA CASTRO","ESCUELA BASICA BENJAMIN VICUNA MACKENNA",null,null,"ESCUELA LUIS UNDURRAGA","ESCUELA CARLOS SPANO","COLEGIO HUACHIPATO",null,"ESCUELA ARTISTICA ARMANDO DUFEY BLANC","ESCUELA LAS ARBOLEDAS",null,"ESCUELA PAUL HARRIS","LICEO MONTENEGRO","ESCUELA HECTOR ISAAC CARRASCO HELDT","ESCUELA L.GRAL.BERNARDO O¦HIGGINS R.",null,"ESCUELA BASICA CALETA DEL MEDIO",null,null,null,null,"ESCUELA CHILE","ESCUELA BASICA ROBERTO CUADRA ALQUINTA","ESCUELA ALEMANIA",null,"ESCUELA MARCELA PAZ","ESCUELA DE DIAGUITAS JUAN TORRES M.","ESCUELA BASICA 21 DE MAYO","ESCUELA JAPON","ESCUELA HERNAN LOBOS ARIAS","ESCUELA DIEGO PORTALES","ESCUELA MARIANO LATORRE",null,"ESCUELA SANTA ELENA","ESCUELA MUNICIPAL RERE"]
["* Corresponde al reemplazo de un RINJU por defectos de fábrica",null,null,null,null,null,null,null,null,null,null,null,null,null,null,3,null,"Tio/a",null,"ALTO HOSPICIO",null,"ESCUELA LITORAL AUSTRAL",null,null,null,null,null,"ESCUELA RURAL LUIS ALBERTO SEGOVIA ROSS",null,"ESCUELA HERMANOS CARRERA","ESCUELA DE PARVULOS BLANCA NIEVES",null,"ESCUELA BASICA VICENTE MILLAN IRIARTE","ESCUELA AMERICA","ESCUELA VALDIVIA DE PAINE","ESCUELA COLTON QUILLAY","ESCUELA ESTER SILVA SOMARRIVA BARTOLILLO",null,"ESCUELA EL PARAISO","ESCUELA BASICA JUAN LAVIN ALVEAR","ESCUELA DE PARVULOS LOS ENANITOS","ESCUELA RURAL CHAYAHUE",null,"ESCUELA BASICA PALESTINA",null,null,null,"ROMILIO ADRIAZOLA",null,null,"ESCUELA RURAL ANA NELLY OYARZUN CARTES","ESCUELA SAN JOSE DE CATEMU","ESCUELA INDEPENDENCIA","ESCUELA LOTHAR KOMMER BRUGER","ESCUELA DOCTOR TREVISO GIRARDI TONELLI","ESCUELA BASICA PEDRO LUJAN",null,null,null,"ESCUELA LA ESPERANZA",null,"ESCUELA BASICA CAPILLA COX",null,"ESCUELA ESPECIAL AYUDANDO A CRECER",null,null,null,null,null,null,"ESCUELA EUGENIO GARCIA FERNANDEZ","ESCUELA VILLA JESUS DE COELEMU","ESCUELA RURAL PABLO NERUDA","ESCUELA HEROES DE IQUIQUE",null,"ESCUELA LOMAS DE PUTAGAN",null,"ESCUELA BASICA SAN VICENTE DE LO ARCAYA","ESCUELA MININCO","ESCUELA MUNIC.SBTE LUIS CRUZ MARTINEZ",null,"COLEGIO MARINA DE CHILE","ESCUELA CAMILO HENRIQUEZ",null,"ESCUELA SUPERIOR NUEVA BILBAO",null,"ESCUELA DIFERENCIAL PUKARA","ESCUELA BASICA MARIO MUNOZ SILVA","ESCUELA BASICA PLAYAS NEGRAS",null,"LICEO MUNICIPAL ATENEA",null,null,null,"ESCUELA INDEPENDENCIA",null,null,"ESCUELA AGUAS NEGRAS",null,null,"ESCUELA SAN JORGE DE NIQUEN","ESCUELA LAURA MATUS MELENDEZ","ESCUELA DIFERENCIAL MUNICIPAL AMAPOLAS","ESCUELA BASICA JOSE MARTI","ESCUELA MATA REDONDA","LICEO POLIV. LUIS HUMBERTO ACOSTA GAY",null,null,null,"LICEO ALONSO DE ERCILLA Y ZUÑIGA","ESCUELA BASICA JAPON",null,null,null,null,null,null,"ESCUELA RURAL NONTUELA","ESCUELA MUNICIPAL GABRIELA MISTRAL",null,null,null,"ESCUELA BASICA RABUCO",null,null,"ESCUELA REPUBLICA DEL PERU",null,null,null,"ESCUELA SANTIAGO DE GUAYAQUIL","ESCUELA BASICA VALLE DEL CHOAPA",null,"ESCUELA CALETA SAN MARCOS",null,null,null,"LICEO POLIVALENTE OLOF PALME",null,null,"ESCUELA DE PARVULOS SAMORITO","ESCUELA BAS. TECNO SUR",null,"ESCUELA REPUBLICA DE VENEZUELA","ESCUELA PABLO DE ROKHA","LICEO EUGENIO MAR-A DE HOSTOS","COLEGIO COQUIMBITO","ESCUELA PRESIDENTE JORGE ALESSANDRI R.",null,"ESCUELA LAS CI+NAGAS","ESCUELA POLONIA GUTIERREZ C.",null,"ESCUELA MUNICIPAL VILMA ALIAGA CALDERON",null,"ESCUELA IRENE FREI","ESCUELA GUILLERMO RODRIGUEZ RIOBIO",null,"ESCUELA SUPERIOR MIXTA N¦ 88","ESCUELA LAS TOSCAS",null,"ESCUELA JORGE PRIETO LETELIER",null,null,"ESCUELA BASICA COEDUCACIONAL","ESCUELA JAIME GOMEZ GARCIA",null,null,"ESCUELA EL CARMEN","ESCUELA MUNICIPAL FRONTERIZA","ESCUELA PILPILCO","ESCUELA FERROVIARIA","ESCUELA BASICA 21 DE MAYO","ESCUELA RURAL EL SALTO","ESCUELA RURAL PARAGUAY CHICO",null,null,"ESCUELA BASICA COLCURA",null,"ESCUELA CHACAYES",null,null,"ESCUELA BASICA REINA DE SUECIA",null,null,null,"LICEO MUNICIPAL F-N¦860","ESCUELA RURAL MISSISSIPPI","ESCUELA QUINIPEUMO","ESCUELA RURAL JUANITA GALLARDO",null,null,"ESCUELA BASICA EL PABELLON","ESCUELA QUECHEREGUAS DE PICHINGAL","ESCUELA CHILECITO","ESCUELA EL RINCON","ESCUELA VILLA LA GRANJA","ESCUELA TOQUI LAUTARO",null,null,null,null,null,null,"ESCUELA ARENAS BLANCAS",null,null,"ESCUELA LAS PALMAS DEL NIÑO DIOS","ESCUELA FUNDACION PAUL HARRIS","ESC.BAS.JUAN PABLO ARTIGUES PENAFIEL",null,"ESCUELA LAUREL HUACHO",null,"ESCUELA RURAL EL LLOLLY","ESCUELA BASICA G N¦831 JAVIER EYZAGUIRRE ECHAURREN",null,"LICEO SAN JOSE DEL CARMEN","ESCUELA MARIA ALVARADO GARAY",null,null,"ESCUELA UNION DE MUJERES AMERICANAS","ESCUELA IGNACIO URRUTIA DE LA SOTTA","ESCUELA REPUBLICA CHECA","ESCUELA ESPECIAL PONTIFICE JUAN PABLO II","ESCUELA CIUDAD DE BARCELONA",null,null,null,null,"ESCUELA ETHEL HENCK DE GRANT",null,null,"LICEO CORDILLERA",null,null,"ESCUELA ESPECIAL DE PICHIDEGUA",null,null,null,null,"LICEO SAN FRANCISCO",null,null,"ESCUELA ESTRELLA DEL SUR",null,null,"ESCUELA LA CHOCOTA",null,"ESCUELA BASICA MELVIN JONES","ESCUELA EJERCITO LIBERTADOR","ESCUELA ANAHUAC",null,"ESCUELA RURAL COLONIA RIO SUR",null,null,"ESCUELA ESPANA",null,null,"ESCUELA VILLA LO BURGOS","ESCUELA MARIA LEIVA DE IBANEZ",null,"ESCUELA RURAL PILMAIQUEN",null,"ESCUELA RURAL YALDAD","ESCUELA RURAL MONTEMAR",null,"ESCUELA LUIS CRUZ MARTINEZ",null,"ESCUELA BASICA HUACAMALA","ESCUELA BASICA LAS PATAGUAS","ESCUELA BASICA GASPAR CABRALES",null,null,"ESCUELA CALICANTO",null,null,"COLEGIO MUNICIPAL EDUARDO DE GEYTER",null,null,"ESCUELA PUERTO RICO",null,"ESCUELA DOMINGO SANTA MARIA GONZALEZ","COLEGIO MUNICIPAL LO DE LOBO","ESCUELA DAVID DEL CURTO","ESCUELA ROMERAL",null,"ESCUELA RURAL CRUCERO",null,null,null,null,null,"ESCUELA GUAICO CENTRO","LICEO REINO DE SUECIA","ESCUELA SANTA ROSA","ESCUELA BASICA PANGUESILLO","ESCUELA BASICA LEYDA","ESCUELA BASICA ANTUPILLAN","ESCUELA ESPECIAL RENACER","ESCUELA CHEQUEN DE LA PENA","ESCUELA LO CALVO",null,"ESCUELA BUCALEMITO","ESCUELA BASICA ANTONIO LARA MEDINA",null,"ESCUELA MAR-A LUISA ESPINOZA RUIZ","ESCUELA JUAN DE DIOS ALDEA","ESCUELA BASICA FRAY CAMILO HENRIQUEZ","ESCUELA JULIETA BECERRA ALVAREZ",null,"ESCUELA VILLA SAN MIGUEL","LICEO T+CNICO PUENTE ÑUBLE","ESCUELA RURAL TRUMAO","ESCUELA ENRIQUE REYMOND ALDUNATE",null,"ESCUELA BASICA MICHAIHUE",null,"ESCUELA BASICA VILLA LA CULTURA",null,"ESC.JUAN BARROS ROLDAN","ESCUELA LOS BOLDOS","ESCUELA MUNICIPAL DE BARREALES",null,"ESCUELA SANTA FILOMENA","ESCUELA BASICA IRENE FREI DE CID",null,null,"ESCUELA MANUEL RODRIGUEZ ERDOIZA","ESCUELA CARLOS TRUPP WANNER","COLEGIO LOS CONDORES",null,"ESCUELA ARTURO PRAT","ESCUELA LAS LIRAS",null,"ESCUELA VICTOR MANUEL SANCHEZ CABANAS","LICEO POLIVALENTE MANUEL RODRIGUEZ","ESCUELA MAPODUNGUN","ESCUELA PABLO NERUDA",null,"ESCUELA BASICA CARLOS MAHNS CHOUPAY",null,null,null,null,"ESCUELA DE NIEBLA JUAN BOSCH","ESCUELA BASICA SARA BEMBOW VILLEGAS","ESCUELA AMERICA",null,"ESCUELA MUNICIPAL MONICA GEBERT MEIER","ESCUELA EDMUNDO VIDAL CARDENAS","ESCUELA BASICA CHORRILOS","ESCUELA MARTIN ALONQUEO PIUTRIN","ESCUELA JOSE PALMA FERNANDEZ","ESCUELA EL PATAGUAL","ESCUELA VALENTIN LETELIER",null,"ESCUELA SILVANO FERNANDEZ","ESCUELA PADRE PEDRO CAMPOS MENCHACA"]
["ID","Estado","Fecha de Entrega","Entrega de reposición*","Niño(a) o adulto sin Rol Único Nacional (RUN)","RUN Niño(a)","DV","Nombre completo niño","RUN adulto receptor","DV","Nombre completo adulto receptor","Parentesco del niño(a) con adulto receptor","¿El apoderado o cuidador participa de una reunión informativa respecto del uso de RINJU?",null,null,4,null,"Hermano/a",null,"ANCUD",null,"ESCUELA PEDRO AGUIRRE CERDA",null,null,null,null,null,"ESCUELA RURAL MANAO",null,"ESCUELA JOS+ EL-AS BOLIVAR HERRERA","ESCUELA DE PARVULOS LOS PINGUINITOS",null,"ESCUELA EDELMIRA VERGARA QUIÑONES","ESCUELA CARLOS CONDELL DE LA HAZA","ESCUELA VILLASECA","ESCUELA EL CARACOL","ESCUELA HANS WENKE MENGERS",null,"ESCUELA EL PROGRESO","ESCUELA BASICA LA GRANJA","ESCUELA DE PARVULOS PAPELUCHO","ESCUELA RURAL EL ROSARIO",null,"ESCUELA BASICA SANTA ROSA DEL HUERTO",null,null,null,null,null,null,"ESCUELA RURAL MIRTA OYARZO VERA",null,"ESCUELA LOS CONQUISTADORES","ESCUELA SANTA ADELA","ESCUELA ESPECIAL SGTO.CADELARIA",null,null,null,null,"ESCUELA REPUBLICA FEDERAL ALEMANA",null,"ESCUELA BASICA COLLIGUAY",null,"ESCUELA MUNICIPAL",null,null,null,null,null,null,null,null,"ESCUELA RURAL VALLE DE LA LUNA","ESCUELA MANUEL MATUS HERMOSILLA",null,"ESCUELA MAULE SUR",null,"ESCUELA BASICA SANTA MARTA DE LIRAY","ESCUELA NICOLAS PEREZ CARDENAS","ESCUELA MUNICIPAL DE RINCONADA DE IDAHUE",null,"ESCUELA BÁSICA COM+N HOSPITAL","ESCUELA D-114",null,"LICEO RURAL ENRIQUE MAC IVER",null,"ESCUELA EL CHANAR","ESCUELA BASICA REPUBLICA DE ITALIA","ESCUELA BASICA RAMON FREIRE SERRANO",null,null,null,null,null,"ESCUELA PABLO NERUDA",null,null,"ESCUELA CATALUNA",null,null,"ESCUELA ZEMITA","ESCUELA LO MIRANDA","ESCUELA GUILLERMO ZANARTU IRIGOYEN","ESCUELA BASICA MARIO ARCE GATICA","ESCUELA NAVIDAD-TREHUALEMU",null,null,null,null,null,"ESCUELA BASICA PACTO ANDINO",null,null,null,null,null,null,null,"ESCUELA MUNICIPAL RIO QUILLEN",null,null,null,"ESCUELA MONICA HURTADO EDWARDS",null,null,"ESCUELA THOMAS JEFFERSON D 465",null,null,null,null,"ESCUELA BASICA VILLA LOS NARANJOS",null,"ESCUELA CENTENARIO",null,null,null,null,null,null,"ESCUELA ELSA SANTIBANEZ","ESCUELA BASICA ISLAS DE CHILE",null,null,"LICEO MUNICIPAL EL ROBLE",null,"COLEGIO DE ALGARROBITO","ESCUELA RADIMADI",null,"ESCUELA NIVEQUETEN","ESCUELA REPUBLICA DE POLONIA",null,"ESCUELA REPUBLICA DE GRECIA",null,"ESCUELA LOS CACHORROS","ESCUELA LA FORTUNA",null,null,"ESCUELA LLANKANAO MANUEL FRANCISCO MEZA SECO",null,"ESCUELA LAS PALMAS",null,null,"ESCUELA BASICA REPUBLICA DE LAS FILIPINAS","ESCUELA MARISCAL DE AYACUCHO",null,null,"ESCUELA FRANCISCO URRUTIA URRUTIA",null,"ESCUELA ZAIDA ARANEDA VIGUERAS","ESCUELA GABRIELA MISTRAL","ESCUELA BASICA CHACAYAL SUR","ESCUELA RURAL FOLILCO",null,null,null,"ESCUELA BASICA KONRAD ADENAUER",null,"PARVULARIO GRAL. O. BONILLA",null,null,"ESCUELA ESPECIAL ANDALUE",null,null,null,null,"ESCUELA VALLE DE MARIQUINA","ESCUELA RURAL DUAO","ESCUELA RURAL LOS ARCES",null,null,"ESCUELA CLAUDIO ARRAU","ESCUELA REINO DE DINAMARCA","ESCUELA DE FLOR DEL VALLE","ESCUELA ESPECIAL MARIA ALICIA PONCE",null,null,null,null,null,null,null,null,"ESCUELA BASICA EL CRUCERO",null,null,"ESCUELA MONTEVIDEO","ESCUELA GARCIA HURTADO DE MENDOZA","ESC.BASICA SAN ANTONIO DE LA VILLA",null,"ESCUELA LICANCO",null,"ESCUELA RURAL ESTRELLA DE CHILE","ESCUELA BASICA G-N¦830 FRANCISCO LETELIER VALDES",null,null,"ESCUELA RURAL HUELLAHUE",null,null,null,"ESCUELA JOSE MATTA CALLEJON","ESCUELA REPUBLICA DE ISRAEL","ESCUELA JUAN BAUTISTA PASTEN","ESCUELA CONSOLIDADA DAVILA",null,null,null,null,"ESCUELA ISLA DE PASCUA",null,null,"LICEO JOSE MANUEL BORGONO NUNEZ",null,null,"ESCUELA LARMAHUE",null,null,null,null,null,null,null,"OASIS EN EL DESIERTO",null,null,"ESCUELA LA GREDA",null,"ESCUELA EL SALITRE","ESCUELA LAS PALMAS","ESCUELA BASICA KIMUN LAWAL",null,"ESCUELA RURAL EPSON DE ENSENADA",null,null,"ESCUELA ESPECIAL ROTARIO PAUL HARRIS",null,null,null,"ESCUELA PASO HISTORICO EL TARTARO",null,null,null,null,"ESCUELA RURAL SANTA ROSA",null,"ESCUELA MUNICIPAL VALLE DE LUNA",null,"ESCUELA BASICA LIUCURA BAJO","ESCUELA BASICA RAMON FREIRE","ESCUELA BASICA JORGE ROCK LARA",null,null,"ESCUELA DIEGO PORTALES",null,null,"COLEGIO PABLO GARRIDO",null,null,"ESCUELA RAFAEL VALDIVIESO",null,"ESCUELA GENERAL ALEJANDRO GOROSTIAGA O","COLEGIO MUNICIPAL LOS CHOAPINOS","ESCUELA MUNICIPAL SANTA AMALIA","ESCUELA SANTA CECILIA",null,"ESCUELA RURAL EL ARRAYAN",null,null,null,null,null,"ESCUELA RAMON FREIRE",null,"ESCUELA VILLA PRAT","ESCUELA COIRON","ESCUELA BASICA SAN JOSE DE CALASANZ","ESCUELA BASICA CINCO PINOS","ESCUELA GENERAL DOMINGO URRUTIA","ESCUELA CORRALONES","ESCUELA PABLO NERUDA",null,"ESCUELA BUEN PASTOR","ESCUELA BASICA GASPAR MARIN",null,"ESCUELA MAYULERMO","ESCUELA JULIO MONTT SALAMANCA","ESCUELA POETA VICTOR DOMINGO SILVA",null,null,null,null,null,"LICEO MUNICIPAL DE SAN PEDRO",null,"ESCUELA DARIO SALAS MARCHANT",null,"ESCUELA NANIHUE",null,"ESC.PARROCO M.BUSTAMANTE","ESCUELA MARIANO PUGA VEGA","ESCUELA MUNICIPAL DE GUINDO ALTO",null,"LICEO DARIO SALAS","ESCUELA BASICA PROVINCIA DE CHILOE",null,null,"ESCUELA REPUBLICA DE GRECIA","ESCUELA CENTINELA","COLEGIO REMODELACION SIMONS",null,"ESCUELA BOYECO","ESCUELA LOS ALISOS",null,null,null,"ESCUELA PRIMER AGUA",null,null,"ESCUELA BASICA CERRO ESTANQUE",null,null,null,null,"ESCUELA EL BOSQUE","ESCUELA BASICA SOR TERESA DE LOS ANDES","ESCUELA BASICA CIRUJANO VIDELA",null,"ESCUELA PAILAHUEQUE","ESCUELA FEDERICO BARNES PAYNE","ESCUELA BASICA DR ALDO FRANCIA BOIDO",null,"ESCUELA PROFESOR RAMON LEIVA NARVAEZ","ESCUELA JUAN BAUTISTA ALBERDI","ESCUELA VOIPIR DE NANCUL",null,"LICEO JUAN DE DIOS PUGA","LICEO MUNICIPAL RIO CLARO"]
[1,{"$f":"IF(E9=\"No\",IF(COUNTBLANK(C9:M9)=0,\"Completo\",IF(COUNTBLANK(C9:M9)=10,\"\",\"Falta información\")),IF(E9=\"Si\",IF(COUNTBLANK(C9:M9)=4,\"Completo\",IF(COUNTBLANK(C9:M9)=10,\"\",\"Falta información\")),\"Falta información\"))","v":"Falta información"},null,null,null,null,null,null,null,null,null,null,null,null,null,5,null,"Otro",null,"ANDACOLLO",null,"LICEO MANIHUALES",null,null,null,null,null,"ESCUELA RURAL SAN MIGUEL DE COÑIMO",null,"ESCUELA REPUBLICA FEDERAL ALEMANA","ESCUELA DE PARVULOS MARCELA PAZ",null,"ESCUELA ESPECIAL DE LENGUAJE ARAUCO","ESCUELA DARIO SALAS DIAZ","ESCUELA VILUCO","ESCUELA EL PALPAL DE SANTA CLARA","ESCUELA PABLO NERUDA",null,"ESCUELA LAS OBRAS","ESCUELA BASICA LLONCAO","ESCUELA DE PARVULOS QUILLA ANTAY","ESCUELA RURAL PARGUA",null,"ESCUELA BASICA VILLA LA FLORIDA",null,null,null,null,null,null,"ESCUELA RURAL OLINDA BORQUEZ BORQUEZ",null,"ESCUELA OCTAVIO PALMA PEREZ","LICEO POLIVALENTE DR. LUIS VARGAS SALCEDO","ESCUELA FEDERICO ACEVEDO SALAZAR",null,null,null,null,"LICEO JOSE HIPOLITO SALAS Y TORO",null,"ESCUELA BASICA CONFLUENCIA",null,"ESCUELA MUNICIPAL",null,null,null,null,null,null,null,null,"ESCUELA RURAL VALLE SIMPSON","ESCUELA MARTA COLVIN ANDRADE",null,"ESCUELA MONSENOR MANUEL LARRAIN E.",null,"ESCUELA BASICA SANTA TERESA DEL CARMELO","ESCUELA THOMAS ALBA EDISON","ESCUELA MUNICIPAL DE VINA LA CRUZ",null,"ESCUELA BÁSICA IRENE FREI DE CID","ESCUELA DRA.ELOISA DIAZ INSUNZA",null,"LICEO RURAL PUTU",null,"ESCUELA EL PALOMAR","ESCUELA CARDENAL JOSE MARIA CARO","ESCUELA ESCUADRON",null,null,null,null,null,"ESCUELA RAMIRO ROA GONZALEZ",null,null,"ESCUELA DIEGO PORTALES P.",null,null,"LICEO SAN GREGORIO","ESCUELA PLAZUELA","ESCUELA JUAN MOYA MORALES","ESCUELA BASICA PAUL HARRIS","ESCUELA VIRGEN DEL CARMEN",null,null,null,null,null,"ESCUELA BASICA PROF.RAMON DEL RIO",null,null,null,null,null,null,null,"ESCUELA SAN JUAN DE AILLINCO",null,null,null,"LICEO MUNICIPAL LUIS LABORDA",null,null,"LICEO T+CNICO PROFESIONAL LUCILA GODOY ALCAYAGA",null,null,null,null,"ESCUELA JUAN CARRASCO RISCO",null,"ESCUELA CHIPANA",null,null,null,null,null,null,"ESCUELA GUARDIAMARINA ERNESTO RIQUELME","ESCUELA BELGICA",null,null,"LICEO MUNICIPALIZADO CENT.ED. LA PINTANA",null,"COLEGIO GABRIEL GONZALEZ VIDELA","ESCUELA RURAL ALDEA CAMPESINA",null,"ESCUELA PUENTE PERALES","ESCUELA SANTA BARBARA",null,null,null,"ESCUELA LOS CARRERA","ESCUELA PEHUEN",null,null,"ESCUELA LOS LEONES",null,"ESCUELA LAS PENAS",null,null,"ESCUELA BASICA SALOMON SACK","ESCUELA POETA PABLO NERUDA",null,null,"ESCUELA GABRIEL BENAVENTE BENAVENTE",null,null,"ESCUELA IGNACIO CARRERA PINTO","ESCUELA BASICA EL AMANECER DE DUQUECO",null,null,null,null,"ESCUELA BASICA SANTA MARIA DE GUADALUPE",null,null,null,null,"ESCUELA GENERAL OHIGGINS",null,null,null,null,"LICEO POLITECNICO PESQUERO","ESCUELA RURAL NUMPAY",null,null,null,"ESCUELA GRAL. CAROL URZUA","ESCUELA SAN PEDRO DE MOLINA","ESCUELA EL PALQUI","LICEO ELVIRA SANCHEZ DE GARCES",null,null,null,null,null,null,null,null,"ESCUELA BASICA MANIO DUCANAN",null,null,null,"ESCUELA JUAN RICARDO SANCHEZ ASCENCIO","ESC.PADRE JOSEPH BENEDIKT STEGMEIER",null,"ESCUELA METRENCO",null,null,"ESCUELA BASICA G-N¦832 AGUILA SUR",null,null,"ESCUELA RURAL LA RINCONADA",null,null,null,"ESCUELA LUIS ARMANDO GOMEZ MUNOZ","ESCUELA ROSALINA PESCIO VARGAS","ESCUELA LUIS ARRIETA CANAS","ESCUELA DE PARVULOS RAYITO DE LUZ",null,null,null,null,"ESCUELA LA GREDA",null,null,null,null,null,"ESCUELA MUNICIPAL DE CALEUCHE",null,null,null,null,null,null,null,null,null,null,"ESCUELA MAITENCILLO",null,"ESCUELA ELVIRA SANTA CRUZ OSSA","ESCUELA LOS ANDES","ESCUELA BASICA LAS CAMELIAS",null,null,null,null,"ESCUELA GENERAL MANUEL BULNES P.",null,null,null,"ESCUELA RENACER",null,null,null,null,"ESCUELA RURAL TAC",null,"ESCUELA PROFESORA MARIA LUISA SEPULVEDA",null,"ESCUELA BASICA PASO EL ROBLE","ESCUELA BASICA REPUBLICA DE MEXICO","ESCUELA GUARDIAMARINA GUILLERMO ZANARTU I.",null,null,"ESCUELA ESPANA",null,null,"COLEGIO SANTA FILOMENA",null,null,"ESCUELA SARGENTO 2. DANIEL REBOLLEDO",null,"ESCUELA GENERAL MANUEL BULNES PRIETO","COLEGIO MUNICIPAL LUIS GALDAMES","LICEO REQUINOA","ESCUELA SANTA DELFINA",null,"ESCUELA RURAL MANTILHUE ALTO",null,null,null,null,null,"ESCUELA TRES ESQUINAS",null,null,"ESCUELA EL TAMBO","ESCUELA CRISTO DEL MAIPO","ESCUELA BASICA DR LUIS SEPULVEDA SALVATI","ESCUELA GENERAL JOS+ MIGUEL CARRERA VERDUGO","ESCUELA DE PARVULOS SAN CLEMENTE","ESCUELA RIO COLORADO",null,"ESCUELA CARMELA CARVAJAL DE PRAT","ESCUELA BASICA ISABEL LA CATOLICA",null,"ESCUELA SELVA NEGRA","ESCUELA JUSTA NARVAEZ","LICEO MUNICIPAL SAN JOAQUIN",null,null,null,null,null,null,null,"ESCUELA ENRIQUE SORO BARRIGA",null,"LICEO MUNICIPAL PURKUYEN",null,"ESCUELA EL LIBERTADOR",null,"ESCUELA MUNICIPAL DE ISLA DE YAQUIL",null,null,"ESCUELA BASICA REPUBLICA DE COLOMBIA",null,null,"LICEO POLIVALENTE TALAGANTE","ESCUELA COOPERATIVA LIRCAY MANUEL YAÑEZ OLAVE","ESCUELA BASICA BUENA VISTA",null,"ESCUELA CAMPOS DEPORTIVOS","ESCUELA MONTERILLA",null,null,null,null,null,null,"ESCUELA BASICA COCHOLGUE",null,null,null,null,"ESCUELA EL LAUREL","ESCUELA EDMUNDO QUEZADA ARAYA","ESCUELA BLAS CUEVAS RAMON ALLENDE",null,"ESCUELA SELVA OSCURA","ESCUELA JOSE ABELARDO NUNEZ","ESCUELA BASICA HUMBERTO VILCHEZ ALZAMORA",null,"ESCUELA TIMOTEO ARAYA ALEGRIA","ESCUELA LATINA INES GALLARDO ORELLANA",null,null,"LICEO JUAN GOMEZ MILLAS","LICEO T+CNICO PROFESIONAL GONZALO GUGLIELMI MONTIEL"]
[2,{"$f":"IF(E10=\"No\",IF(COUNTBLANK(C10:M10)=0,\"Completo\",IF(COUNTBLANK(C10:M10)=10,\"\",\"Falta información\")),IF(E10=\"Si\",IF(COUNTBLANK(C10:M10)=4,\"Completo\",IF(COUNTBLANK(C10:M10)=10,\"\",\"Falta información\")),\"Falta información\"))","v":"Falta información"},null,null,null,null,null,null,null,null,null,null,null,null,null,6,null,null,null,"ANGOL",null,null,null,null,null,null,null,"ESCUELA RURAL SENDA CHACAO",null,"ESCUELA VILLA HUEQUEN","ESCUELA DE PARVULOS SEMILLITA",null,"ESCUELA JORGE IVAN VALENZUELA ZUNIGA","ESCUELA DR. RICARDO OLEA GUERRA","LICEO 131","ESCUELA EVARISTA OGALDE ORTEGA",null,null,"ESCUELA ORLANDO VERA VILLARROEL","ESCUELA BASICA RENE ANDRADES TOLEDO","ESCUELA DIFERENCIAL LOA","ESCUELA RURAL PEÑASMO",null,"ESCUELA ESPECIAL JESUS DE NAZARETH",null,null,null,null,null,null,"ESCUELA RURAL PEDRO VELAZQUEZ BONTES",null,"ESCUELA PEDRO DE VALDIVIA",null,"ESCUELA GENERAL RENE ESCAURIAZA",null,null,null,null,null,null,"ESCUELA BASICA DIEGO BARROS ARANA",null,"ESCUELA MUNICIPAL",null,null,null,null,null,null,null,null,"ESCUELA VICTOR DOMINGO SILVA","ESCUELA PORVENIR DE CATO",null,"ESCUELA PANIMAVIDA",null,"ESCUELA CAMINO ALTO",null,"ESCUELA MUNICIPAL JOSEFINA VIAL DE VIAL",null,"ESCUELA BASICA AGUA DE LA GLORIA","ESCUELA ESP. HUMBERTO ARANDA IRRIBARREN",null,"MAESTRA M.FRESIA HORMAZABAL LETELIER",null,"ESCUELA FUNDICION PAIPOTE","ESCUELA COQUIMBO","ESCUELA FRANCISCO COLOANE",null,null,null,null,null,"ESCUELA SAN JOSE DE COLICO",null,null,"ESCUELA EL MAITEN",null,null,"LICEO TIUQUILEMU",null,"ESCUELA REPUBLICA DE COSTA RICA","ESCUELA BASICA VILLA SANTA ELENA",null,null,null,null,null,null,"ESCUELA BASICA REPUBLICA DE FRANCIA",null,null,null,null,null,null,null,null,null,null,null,null,null,null,null,null,null,null,null,null,null,"ESCUELA EDUARDO LLANOS",null,null,null,null,null,null,"ESCUELA LAS ARAUCARIAS","ESCUELA DIFERENCIAL SANTA TERESITA DE LOS AND",null,null,"LICEO N523",null,"COLEGIO HEROES DE LA CONCEPCION","ESCUELA RURAL CATAMUTUN",null,null,"NORMA GONZ-LEZ GUERRA",null,null,null,"LICEO LOS CASTANOS","ESCUELA PROFESORA REBECA CASTRO ARANEDA",null,null,"ESCUELA MAITENES",null,"ESCUELA LAS VEGAS",null,null,"ESCUELA BASICA SANTA ADRIANA","ESCUELA POETA VICENTE HUIDOBRO",null,null,"ESCUELA GABRIELA MISTRAL",null,null,"ESCUELA JOHN KENNEDY","ESCUELA BASICA EL NOGAL.",null,null,null,null,"ESCUELA BASICA THOMPSON MATTHEWS",null,null,null,null,"ESCUELA GENERAL SAN MARTIN",null,null,null,null,null,null,null,null,null,"ESCUELA HUECHUN","ESCUELA SUPERIOR DE NINAS DE MOLINA","ESCUELA ESPERANZA DE HUANA",null,null,null,null,null,null,null,null,null,"ESCUELA JUAN XXIII",null,null,null,"ESCUELA LAGO RUPANCO","ESCUELA ALCONES BAJOS",null,"ESCUELA NIRRIMAPU",null,null,"ESCUELA CARMEN REVECO NUNEZ",null,null,"ESCUELA RURAL LAGO AZUL",null,null,null,"ESCUELA NIDER ORREGO QUEVEDO","ESCUELA SONIA PLAZA CASTRO","ESCUELA SANTA MARIA DE PENALOLEN","ESCUELA LO VALLEDOR",null,null,null,null,"ESCUELA PENCO",null,null,null,null,null,"ESCUELA MUNICIPAL DE SAN ROBERTO",null,null,null,null,null,null,null,null,null,null,"ESCUELA MULTIDEFICIT AMANECER",null,"ESCUELA ESTADO DE FLORIDA","ESCUELA LUIS MATTE LARRAIN","ESCUELA BASICA LICARAYEN",null,null,null,null,"ESCUELA HERNANDO DE MAGALLANES",null,null,null,"ESCUELA SAN ALBERTO",null,null,null,null,null,null,null,null,"ESCUELA PEDRO ENRIQUE TORRES SABELLE","ESCUELA CRISTINA DURAN","ESCUELA LOS MOLLES DE MARGA MARGA",null,null,"ESCUELA GIL DE CASTRO",null,null,"ESCUELA DUENDE MELODIA",null,null,"ESCUELA VICTOR CUCCUINI",null,"ESCUELA JUANA ATALA DE HIRMAS","COLEGIO MUNICIPAL VILLA DEL COBIL",null,"ESCUELA SANTA ISABEL",null,"ESCUELA RURAL TRAPI",null,null,null,null,null,null,null,null,"ESCUELA MATILDE SALAMANCA","ESCUELA MOVILIZADORES PORTUARIOS","ESCUELA CARDENAL ANTONIO SAMORE","ESCUELA GENERAL SOFANOR PARRA HERMOSILLA","ESCUELA DEIDAMIA PAREDES BELLO",null,null,"ESCUELA ESPECIAL SAGRADO CORAZON","ESCUELA BERNARDO MORENO FREDES",null,"LICEO MANUEL JESUS ORTIZ","ESCUELA MANUEL DE SALAS",null,null,null,null,null,null,null,null,"ESCUELA MIGUEL JOSE ZANARTU SANTA MARIA",null,"LICEO MUNICIPALIZADO ARAUCANIA",null,"ESCUELA ESPECIAL PAULA JARAQUEMADA",null,"ESCUELA MUNICIPAL DE LA PATAGUA",null,null,"ESCUELA BASICA REPUBLICA DE HAITI",null,null,null,"ESCUELA COSTANERA","ESCUELA BASICA CERRO CORNOU",null,"ESCUELA COLLIMALLIN","ESCUELA MORZA",null,null,null,null,null,null,"ESCUELA BASICA DICHATO",null,null,null,null,"ESCUELA ESPANA","ESCUELA GABRIELA MISTRAL","ESCUELA CARABINERO PEDRO A.CARIAGA M.",null,null,"ESCUELA NEFTALI REYES","ESCUELA BASICA JOHN KENNEDY",null,"ESCUELA TRINIDAD ALCAINO TAPIA","ESCUELA MANUEL MONTT"]
[3,"Falta información",null,null,null,null,null,null,null,null,null,null,null,null,null,7,null,null,null,"ANTOFAGASTA",null,null,null,null,null,null,null,"ESCUELA RURAL SOL DEL PACIFICO",null,null,"ESCUELA ECUADOR",null,"ESCUELA LOS PINOS","ESCUELA ESMERALDA","LICEO ALTO JAHUEL","ESCUELA LOS TILOS",null,null,"ESCUELA PILLANCO","ESCUELA BASICA RUBI NELSON SILVA SALAS","ESCUELA PARVULARIA LAS ARDILLAS","ESCUELA RURAL PUTENIO",null,"ESCUELA MONTE CARMELO",null,null,null,null,null,null,"ESCUELA TERESA DE LOS ANDES",null,"ESCUELA PORONGO",null,"ESCUELA HERMINDA DE LA VICTORIA",null,null,null,null,null,null,"ESCUELA BASICA EL TEJAR",null,"ESCUELA MUNICIPAL",null,null,null,null,null,null,null,null,"LICEO REPUBLICA ARGENTINA","ESCUELA TALQUIPEN",null,"ESCUELA RARI",null,"ESCUELA PREMIO NOBEL PABLO NERUDA",null,"ESCUELA MUNICIPAL OSVALDO RUIZ GARCIA",null,"ESCUELA BASICA FUNDO CHANCO","ESCUELA HORACIO JOHNSON GANA",null,null,null,"ESCUELA HERNAN MARQUEZ HUERTA","ESCUELA DE PENUELAS","ESCUELA JORGE ROJAS MIRANDA",null,null,null,null,null,"ESCUELA SANTA TERESA DE LOS ANDES",null,null,"ESCUELA ERNESTO CASTRO ARELLANO",null,null,null,null,"ESCUELA REPUBLICA DE FRANCIA","ESCUELA BERNARDO LEIGHTON",null,null,null,null,null,null,"ESCUELA BASICA UNION LATINOAMERICANA",null,null,null,null,null,null,null,null,null,null,null,null,null,null,null,null,null,null,null,null,null,"ESCUELA GABRIELA MISTRAL",null,null,null,null,null,null,"ESCUELA LAS LILAS","LICEO DOCTOR ALEJANDRO DEL RIO",null,null,"LICEO VICTOR JARA",null,"COLEGIO JAPON","ESCUELA RURAL CHOROICO",null,null,null,null,null,null,null,null,null,null,"ESCUELA MATIAS COUSINO",null,"ESCUELA NACIONES UNIDAS",null,null,"ESCUELA BLUE STAR COLLEGE","ESCUELA PROFESORA GLADYS VALENZUELA V",null,null,"ESCUELA JOSE MIGUEL CARRERA",null,null,"LICEO REPUBLICA ARGENTINA","ESCUELA BASICA LA AGUADA DE CUEL",null,null,null,null,"ESCUELA ISIDORA GOYENECHEA",null,null,null,null,"ESCUELA LAS AMERICAS",null,null,null,null,null,null,null,null,null,"ESCUELA JOSE CAMARENA ESCRIVA","LUIS MALDONADO BOGGIANO","ESCUELA HUATULAME",null,null,null,null,null,null,null,null,null,"ESCUELA REPUBLICA",null,null,null,"ESCUELA LEONILA FOLCH LOPEZ","ESCUELA ANTONIO TIRADO LANAS",null,"ESCUELA TROMEN",null,null,"ESCUELA DE HOSPITAL",null,null,"ESCUELA RURAL PULLINQUE",null,null,null,"ESCUELA SANTIAGO URRUTIA BENAVENTE","ESCUELA TERESA DE CALCUTA","ESCUELA TOBALABA","ESCUELA POETAS DE CHILE",null,null,null,null,"ESCUELA REPUBLICA DE ITALIA",null,null,null,null,null,"ESCUELA MUNICIPAL EL SALTO",null,null,null,null,null,null,null,null,null,null,null,null,"ESCUELA ESTRELLA DE CHILE","ESCUELA OSCAR BONILLA","ESCUELA BASICA SANTA INES",null,null,null,null,"ESCUELA JUAN WILLIAMS",null,null,null,"LICEO MANUEL MARIN",null,null,null,null,null,null,null,null,null,"ESCUELA ESPECIAL LOS PALTOS","ESCUELA LUIS CRUZ MARTINEZ",null,null,"ESCUELA INGLATERRA",null,null,"ESCUELA MUNICIPAL ALBERTO BLEST GANA",null,null,"LICEO ARTURO PEREZ CANTO",null,"ESCUELA JUANA DE LESTONAC","ESCUELA BASICA VICTOR NICOLETTI TAMANINI",null,null,null,"ESCUELA RURAL VALLE MANTILHUE BAJO",null,null,null,null,null,null,null,null,"ESCUELA TRANQUILLA","ESCUELA POETA HUIDOBRO","ESCUELA DE EDUCACION DIFERENCIAL","ESCUELA JOAQUIN DEL PINO ROZAS Y NEGRETE","ESCUELA EL COLORADO",null,null,"ESCUELA HERIBERTO BERMUDEZ CRUZ","ESCUELA CONCENTRAC. RURAL SERGIO VERDUGO HERRERA",null,null,"ESCUELA MANUEL RODRIGUEZ",null,null,null,null,null,null,null,null,null,null,null,null,"ESCUELA LAS PATAGUAS",null,"ESCUELA MUNICIPAL DE LENGUAJE SANTA CRUZ",null,null,"ESCUELA BASICA REPUBLICA DE MEXICO",null,null,null,"ESCUELA EL EDEN","ESCUELA BASICA CERRO SAN FRANCISCO",null,"ESCUELA DE PARVULOS CAMPANITA","ESCUELA PDTE CARLOS IBANEZ DEL CAMPO",null,null,null,null,null,null,"ESCUELA BASICA IGNACIO SERRANO MONTANER",null,null,null,null,"ESCUELA ESPECIAL WALTER SCHMIDT ROESTEL","ESCUELA GREGORIO CASTILLO MAR-N","ESCUELA DIEGO PORTALES PALAZUELOS",null,null,"ESCUELA RIOS DE ELQUI","ESCUELA BASICA LUISA NIETO DE HAMEL",null,null,"LICEO BICENTENARIO T+CNICO PROFESIONAL MARY GRAHAM"]
[4,"Falta información",null,null,null,null,null,null,null,null,null,null,null,null,null,8,null,null,null,"ANTUCO",null,null,null,null,null,null,null,"ESCUELA RURAL VILLA CHACAO",null,null,"ESCUELA EDDA CUNEO DONNAGIO",null,"ESCUELA VALLE ARAUCO","ESCUELA ESPAÑA","LICEO FRANCISCO JAVIER KRUGGER ALVARADO","ESCUELA MILAHUE",null,null,"ESCUELA QUINEL","ESCUELA BASICA TRES SAUCES",null,"ESCUELA RURAL QUETROLAUQUEN",null,null,null,null,null,null,null,null,null,null,"ESCUELA ROSITA OHIGGINS",null,"ESCUELA LEONARDO DA VINCI",null,null,null,null,null,null,"ESCUELA BASICA JOSE MARIA CARO RODRIGUEZ",null,"ESCUELA MUNICIPAL",null,null,null,null,null,null,null,null,null,null,null,null,null,null,null,"ESCUELA SUBTTE. ARTURO PEREZ CANTO",null,"ESCUELA BASICA LAGOS DE CHILE","ESCUELA PEDRO AGUIRRE CERDA",null,null,null,"ESCUELA ISABEL PENA MORALES","ESCUELA DE TAMBILLOS","ESCUELA JUAN JOSE LATORRE BENAVENTE",null,null,null,null,null,null,null,null,"ESCUELA ESPANA",null,null,null,null,"LICEO CARMELA SILVA DONOSO","ESCUELA CIUDAD DE LYON",null,null,null,null,null,null,"ESCUELA CARLOS CONDELL DE LA HAZA",null,null,null,null,null,null,null,null,null,null,null,null,null,null,null,null,null,null,null,null,null,"ESCUELA PAULA JARAQUEMADA ALQUIZAR",null,null,null,null,null,null,"ESCUELA LO CANAS","LICEO MALAQUIAS CONCHA",null,null,null,null,"COLEGIO JAVIERA CARRERA","ESCUELA RURAL CUINCO",null,null,null,null,null,null,null,null,null,null,"ESCUELA PRESIDENTE CARLOS IBANEZ DEL C.",null,null,null,null,"ESCUELA RAUL SAEZ SAEZ","ESCUELA SOR TERESA DE LOS ANDES",null,null,"ESCUELA JUAN SEGUNDO MUNOZ BRIONES",null,null,null,"ESCUELA BASICA LA CAPILLA",null,null,null,null,null,null,null,null,null,"ESCUELA LEON HUMBERTO VALENZUELA",null,null,null,null,null,null,null,null,null,"ESCUELA LIDIA MATTE HURTADO",null,"ESCUELA JUNTAS",null,null,null,null,null,null,null,null,null,null,null,null,null,"ESCUELA MEXICO DE MICHOACAN","ESCUELA ARTURO VILLALON SIEULANNE",null,"ESCUELA TRUF-TRUF.",null,null,"ESCUELA ELIAS SANCHEZ ORTUZAR",null,null,"ESCUELA RURAL REHUEICO",null,null,null,null,null,"ESCUELA UNION NACIONAL ARABE","ESCUELA VILLA SUR",null,null,null,null,"ESCUELA VIPLA",null,null,null,null,null,"ESCUELA REINO DE DINAMARCA",null,null,null,null,null,null,null,null,null,null,null,null,"ESCUELA LO BOZA","ESCUELA REPUBLICA DE GRECIA","ESCUELA BELLAVISTA",null,null,null,null,"ESCUELA LIBERTADOR CAP GRAL BDO OHIGGINS",null,null,null,"LICEO REPUBLICA DE ESTADOS UNIDOS",null,null,null,null,null,null,null,null,null,"ESCUELA NUESTRO MUNDO","ESCUELA MANUEL BULNES PRIETO",null,null,"ESCUELA INSIGNE GABRIELA",null,null,"ESCUELA MUNICIPAL AUGUSTO D HALMAR",null,null,null,null,"ESCUELA REBECA MATTE BELLO","ESCUELA CARLOS CONDELL DE LA HAZA",null,null,null,"ESCUELA RURAL VIVANCO",null,null,null,null,null,null,null,null,null,"ESCUELA POETA PABLO NERUDA","ESCUELA DIEGO PORTALES","ESCUELA JUNQUILLO","ESCUELA ENRIQUE CORREA GUZMAN",null,null,"ESCUELA JOHN F KENNEDY","ESCUELA JORGE MUNOZ SILVA",null,null,"ESCUELA PEDRO LAGOS",null,null,null,null,null,null,null,null,null,null,null,null,"ESCUELA MUNICIPAL CUCHIPUY",null,"ESCUELA MUNICIPAL DE LOS MAITENES",null,null,"ESCUELA BASICA REPUBLICA DE PANAMA",null,null,null,"ESCUELA EL ORIENTE","ESCUELA BASICA CRUZ DEL SUR",null,"ESCUELA DE PARVULOS SEMILLITA","ESCUELA SAN CRISTOBAL",null,null,null,null,null,null,"ESCUELA BASICA MENQUE",null,null,null,null,"ESCUELA FEDOR M.DOSTOIEVSKI","ESCUELA HERMANOS CARRERA","ESCUELA DR. ERNESTO QUIROZ WEBER",null,null,null,"ESCUELA BASICA REPUBLICA DEL ECUADOR",null,null,"WINDMILL COLLEGE"]
[5,"Falta información",null,null,null,null,null,null,null,null,null,null,null,null,null,9,null,null,null,"ARAUCO",null,null,null,null,null,null,null,"ESCUELA YERBAS BUENAS",null,null,"ESCUELA ELMO FUNEZ CARRIZO",null,"ESCUELA VALLE RAMADILLAS","ESCUELA GABRIELA MISTRAL",null,"LICEO SANTA CRUZ DE LARQUI",null,null,"ESCUELA SALTO EL LAJA","ESCUELA DE LENGUAJE BAMBI",null,"ESCUELA RURAL SAN JOSE",null,null,null,null,null,null,null,null,null,null,"LICEO ANTONIO VARAS",null,"ESCUELA MARIA LUISA BOMBAL",null,null,null,null,null,null,"ESCUELA BASICA JUAN MADRID AZOLA",null,"ESCUELA MUNICIPAL",null,null,null,null,null,null,null,null,null,null,null,null,null,null,null,null,null,"ESCUELA BASICA LAUTARO","ESCUELA SOL NACIENTE",null,null,null,"ESCUELA JESUS FERNANDEZ HIDALGO","ESCUELA GUILLERMO CERECEDA","ESCUELA MAULE",null,null,null,null,null,null,null,null,"ESCUELA ESPECIAL CURICO",null,null,null,null,"LICEO LENKA FRANULIC","ESCUELA CLAUDIO ARRAU LEON",null,null,null,null,null,null,"ESCUELA REPUBLICA DE AUSTRIA",null,null,null,null,null,null,null,null,null,null,null,null,null,null,null,null,null,null,null,null,null,"ESCUELA PLACIDO VILLARROEL",null,null,null,null,null,null,"ESCUELA LOS CEREZOS","LICEO MUNICIPAL LA GRANJA POETA NERUDA",null,null,null,null,"COLEGIO JOSE MANUEL BALMACEDA","ESCUELA RURAL LOS ESTEROS",null,null,null,null,null,null,null,null,null,null,"ESCUELA RAMON BELMAR SALDIAS",null,null,null,null,"LICEO POLIVALENTE","MUSTAFA KEMAL ATATURK",null,null,"ESCUELA LUIS PEREIRA INIGUEZ",null,null,null,"ESCUELA BASICA LA LEYENDA",null,null,null,null,null,null,null,null,null,"ESCUELA PRESIDENTE RIESCO ERRAZURIZ",null,null,null,null,null,null,null,null,null,"ESCUELA PADRE ALBERTO HURTADO",null,"ESCUELA SANTA BERNARDITA",null,null,null,null,null,null,null,null,null,null,null,null,null,"ESCUELA MONSEÑOR FRANCISCO VALDES SUBERCASEAUX","ESCUELA AURORA DE CHILE",null,"ESCUELA TRUMPULO CHICO",null,null,"ESCUELA HUGO PINO VILCHEZ",null,null,null,null,null,null,null,null,"LICEO ANTONIO HERMIDA FABRES","LICEO MUNICIPAL ENRIQUE BACKAUSSE",null,null,null,null,"LICEO RIOS DE CHILE",null,null,null,null,null,null,null,null,null,null,null,null,null,null,null,null,null,null,"ESCUELA MONSENOR CARLOS OVIEDO","ESCUELA VILLA INDEPENDENCIA","ESCUELA CAPITAN ARTURO PRAT CHACON",null,null,null,null,"ESCUELA PADRE ALBERTO HURTADO CRUCHAGA",null,null,null,null,null,null,null,null,null,null,null,null,null,null,"ESCUELA TENIENTE IGNACIO SERRANO MONTANER",null,null,"ESCUELA LO FRANCO",null,null,"ESCUELA MUNICIPAL CARLOS MIRANDA MIRANDA",null,null,null,null,"LICEO THOMAS ALVA EDISON","ESCUELA DIFERENCIAL TERESA NARETTO DE NICOLETTI",null,null,null,null,null,null,null,null,null,null,null,null,null,"ESCUELA PRE-BASICA PETER PAN","ESCUELA ELEODORO YANEZ PONCE DE LEON","ESCUELA LAS ARBOLEDAS","ESCUELA FLOR DEL LLANO",null,null,"ESCUELA JOS+ ANTONIO MANSO DE VELASCO","ESCUELA JOSE DE SAN MARTIN",null,null,"ESCUELA RAMON CARNICER",null,null,null,null,null,null,null,null,null,null,null,null,"ESCUELA MUNICIPAL EL NARANJAL",null,"ESCUELA MUNICIPAL DE MILLAHUE DE APALTA",null,null,"ESCUELA BASICA REYES CATOLICOS",null,null,null,"ESCUELA EL SAUCE","ESCUELA BASICA LA DAMA BLANCA",null,"ESCUELA ESPECIAL NIELOL","ESCUELA SAN RAFAEL",null,null,null,null,null,null,"ESCUELA BASICA MILLAHUE",null,null,null,null,"ESCUELA FERNANDO SANTIVAN","ESCUELA IGNACIO CARRERA PINTO","ESCUELA ELEUTERIO RAMIREZ",null,null,null,"ESCUELA BASICA REPUBLICA DEL LIBANO"]
[6,"Falta información",null,null,null,null,null,null,null,null,null,null,null,null,null,"K",null,null,null,"ARICA",null,null,null,null,null,null,null,null,null,null,"ESCUELA ESPANA",null,"LICEO T+CNICO PESQUERO FILIDOR GAETE MONS-LVEZ","ESCUELA GRAL JOSE MIGUEL CARRERA",null,null,null,null,null,"ESCUELA LEONCIO ARANEDA FIGUEROA",null,"ESCUELA RURAL SAN RAFAEL",null,null,null,null,null,null,null,null,null,null,null,null,"ESCUELA MILLAHUE",null,null,null,null,null,null,"ESCUELA BASICA LA CASTILLA",null,"ESCUELA MUNICIPAL",null,null,null,null,null,null,null,null,null,null,null,null,null,null,null,null,null,"ESCUELA BASICA RENE LOUVEL BERT","ESCUELA UNESCO",null,null,null,"ESCUELA JOSE MANSO DE VELASCO","ESCUELA JOSE ALFARO ALFARO","ESCUELA OCTAVIO SALINAS CARIAGA",null,null,null,null,null,null,null,null,"ESCUELA GRECIA",null,null,null,null,"LICEO REPUBLICA DE SIRIA","ESCUELA DIFERENCIAL PARA NINOS SORDOS",null,null,null,null,null,null,"LICEO ESTACION CENTRAL",null,null,null,null,null,null,null,null,null,null,null,null,null,null,null,null,null,null,null,null,null,"ESCUELA PROFESOR MANUEL CASTRO RAMOS",null,null,null,null,null,null,"ESCUELA MARCELA PAZ",null,null,null,null,null,"COLEGIO JOSE MIGUEL CARRERA","ESCUELA RURAL MASHUE",null,null,null,null,null,null,null,null,null,null,"ESCUELA REPUBLICA DE FRANCIA",null,null,null,null,"LICEO TENIENTE FRANCISCO MERY AGUIRRE",null,null,null,"ESCUELA MARCELA PAZ",null,null,null,"ESCUELA BASICA LA QUEBRADA",null,null,null,null,null,null,null,null,null,"ESCUELA TOMAS VARGAS",null,null,null,null,null,null,null,null,null,"ESCUELA PATRICIO LARRAIN GANDARILLAS",null,null,null,null,null,null,null,null,null,null,null,null,null,null,null,"ESCUELA N. 46 ITALIA","ESCUELA BÁSICA ARTURO ALESSANDRI PALMA",null,null,null,null,"ESCUELA LAS COLONIAS",null,null,null,null,null,null,null,null,null,"LICEO POLIVALENTE EUGENIO PEREIRA SALAS",null,null,null,null,null,null,null,null,null,null,null,null,null,null,null,null,null,null,null,null,null,null,null,"ESCUELA PUERTO FUTURO","ESCUELA VOLCAN SAN JOSE","ESCUELA CAYENEL",null,null,null,null,"ESCUELA PARVULARIA JOSH KEE",null,null,null,null,null,null,null,null,null,null,null,null,null,null,"ESCUELA THEODOR HEUSS",null,null,"ESCUELA MEMBRILLAR",null,null,"ESCUELA MUNICIPAL EL COBRE",null,null,null,null,null,"ESCUELA EL NARANJAL",null,null,null,null,null,null,null,null,null,null,null,null,null,"ESCUELA PRESIDENTE PEDRO AGUIRRE CERDA","ESCUELA ESCRITORA MARCELA PAZ","ESCUELA MANUEL ANTONIO CASTILLO VELASCO","ESCUELA LOS ALMENDROS",null,null,"ESCUELA JOSE BERNARDO SUAREZ","ESCUELA MARIA LUISA BOUCHON",null,null,null,null,null,null,null,null,null,null,null,null,null,null,null,"ESCUELA MUNICIPAL MILLAHUE",null,"ESCUELA MUNICIPAL DE PANIAHUE",null,null,"ESCUELA CADETE ARTURO PRAT CHACON",null,null,null,"ESCUELA ESPECIAL ESPANA","ESCUELA BASICA LAS HIGUERAS",null,"ESCUELA LABRANZA","ESCUELA SUSANA MONTES VELASCO",null,null,null,null,null,null,"ESCUELA BASICA PUNTA DE PARRA",null,null,null,null,"ESCUELA FRANCIA","ESCUELA JOSE CAROCA LAFLOR","ESCUELA ESPANA",null,null,null,"ESCUELA BASICA SANTA JULIA"]
[7,"Falta información",null,null,null,null,null,null,null,null,null,null,null,null,null,null,null,null,null,"BUIN",null,null,null,null,null,null,null,null,null,null,"ESCUELA FUNDACION MINERA ESCONDIDA",null,null,"ESCUELA GRAL. MANUEL BAQUEDANO",null,null,null,null,null,"ESCUELA RICARDO COLOMA DIAZ",null,null,null,null,null,null,null,null,null,null,null,null,null,null,"ESCUELA PROF. MANUEL GUERRERO CEBALLOS",null,null,null,null,null,null,"ESCUELA BASICA LAS CANOAS",null,"ESCUELA MUNICIPAL",null,null,null,null,null,null,null,null,null,null,null,null,null,null,null,null,null,"ESCUELA DIEGO PORTALES PALAZUELOS","ESCUELA VALLE DEL INCA",null,null,null,"ESCUELA LAS BRISAS","ESCUELA JUAN PABLO II","ESCUELA RAFAEL SOTOMAYOR BAEZA",null,null,null,null,null,null,null,null,"ESCUELA HOLANDA",null,null,null,null,null,"ESCUELA GENERAL ALBERTO A. BACHELET MARTINEZ",null,null,null,null,null,null,null,null,null,null,null,null,null,null,null,null,null,null,null,null,null,null,null,null,null,null,null,null,"ESCUELA THILDA PORTILLO OLIVARES",null,null,null,null,null,null,"ESCUELA OSCAR CASTRO",null,null,null,null,null,"COLEGIO LUIS BRAILLE","ESCUELA RURAL PUERTO NUEVO",null,null,null,null,null,null,null,null,null,null,"ESCUELA SALOMON SALMAN DABUD",null,null,null,null,null,null,null,null,"ESCUELA MARIA AMBROSIA TAPIA MENDEZ",null,null,null,"ESCUELA BASICA LAS QUINTAS",null,null,null,null,null,null,null,null,null,"ESCUELA VICENTE REYES PALAZUELOS",null,null,null,null,null,null,null,null,null,"ESCUELA PEDRO MARIN ALEMANY",null,null,null,null,null,null,null,null,null,null,null,null,null,null,null,"ESCUELA N.88 CANADA","ESCUELA BASICA BERNARDO OªHIGGINS RIQUELME",null,null,null,null,"ESCUELA SENDERO DE CULITRIN",null,null,null,null,null,null,null,null,null,null,null,null,null,null,null,null,null,null,null,null,null,null,null,null,null,null,null,null,null,null,null,null,null,"ESCUELA SAN DANIEL","LICEO MUNIC.ING.MILITAR JUAN MACKENA O.","ESCUELA CHILOE",null,null,null,null,"ESCUELA PEDRO PABLO LEMAITRE",null,null,null,null,null,null,null,null,null,null,null,null,null,null,"LICEO GASTRONOMIA Y TURISMO",null,null,"ESCUELA PLATON",null,null,"ESCUELA MUNICIPAL HERMANOS CARRERA",null,null,null,null,null,"ESCUELA FERNANDA AEDO FAUNDEZ",null,null,null,null,null,null,null,null,null,null,null,null,null,"ESCUELA VILLA LAS DUNAS","ESCUELA ESPANA","ESCUELA MILLAUQUEN","ESCUELA LOS MONTES",null,null,"ESCUELA JUAN GOMEZ MILLAS","ESCUELA OLEGARIO LAZO BAEZA",null,null,null,null,null,null,null,null,null,null,null,null,null,null,null,"ESCUELA MUNICIPAL RASTROJOS",null,"ESCUELA MUNICIPAL DE QUINAHUE",null,null,"ESCUELA DE PARV. PARQUE O'HIGGINS",null,null,null,"ESCUELA ESPERANZA","ESCUELA BASICA LIBERTAD",null,"ESCUELA LOS AVELLANOS","ESCUELA TENO",null,null,null,null,null,null,"ESCUELA BASICA RAFAEL",null,null,null,null,"ESCUELA LAS ANIMAS","ESCUELA LUIS CRUZ MARTINEZ","ESCUELA ESPECIAL DE LENGUAJE LIBERTADOR DE LA PATRIA BERNARDO O'HIGGINS",null,null,null,"ESCUELA CANAL BEAGLE"]
[8,"Falta información",null,null,null,null,null,null,null,null,null,null,null,null,null,"Si",null,null,null,"BULNES",null,null,null,null,null,null,null,null,null,null,"ESCUELA GABRIELA MISTRAL",null,null,"ESCUELA IGNACIO CARRERA PINTO",null,null,null,null,null,null,null,null,null,null,null,null,null,null,null,null,null,null,null,null,"ESCUELA PROVINCIA DE ARAUCO",null,null,null,null,null,null,"ESCUELA BASICA LOS HEROES",null,"ESCUELA MUNICIPAL",null,null,null,null,null,null,null,null,null,null,null,null,null,null,null,null,null,"ESCUELA ESPECIAL CHILE ESPAÑA","LICEO MUNC.ALMIRANTE GALVARINO RIVEROS",null,null,null,"ESCUELA LAS CANTERAS","ESCUELA LUCILA GODOY ALCAYAGA","ESCUELA REMIGIO CASTRO ABURTO",null,null,null,null,null,null,null,null,"ESCUELA INTERNADO POTRERO GRANDE",null,null,null,null,null,"ESCUELA MARCIAL MARTINEZ FERRARI",null,null,null,null,null,null,null,null,null,null,null,null,null,null,null,null,null,null,null,null,null,null,null,null,null,null,null,null,"LICEO BICENTENARIO DOMINGO SANTA MARIA DE IQQ.",null,null,null,null,null,null,"ESCUELA SOTERO DEL RIO",null,null,null,null,null,"COLEGIO MANUEL RODRIGUEZ","ESCUELA RURAL TRAIGUEN",null,null,null,null,null,null,null,null,null,null,"ESCUELA SAN ANTONIO",null,null,null,null,null,null,null,null,"ESCUELA ONOFRE VASQUEZ NORAMBUENA",null,null,null,"ESCUELA BASICA MILLANTU",null,null,null,null,null,null,null,null,null,"LICEO JOSE IGNACIO ZENTENO",null,null,null,null,null,null,null,null,null,"ESCUELA PUANGUE",null,null,null,null,null,null,null,null,null,null,null,null,null,null,null,"ESCUELA PARVULARIA `PEDRO AGUIRRE CERDA`","ESCUELA BASICA EL GUINDO",null,null,null,null,"LICEO MARIA CARVAJAL FUENZALIDA",null,null,null,null,null,null,null,null,null,null,null,null,null,null,null,null,null,null,null,null,null,null,null,null,null,null,null,null,null,null,null,null,null,"ESCUELA TENIENTE HERNAN MERINO CORREA","LICEO MUNICIPAL CHILOE","ESCUELA DIFERENCIAL `LOS EUCALIPTOS`",null,null,null,null,"ESCUELA PEDRO SARMIENTO DE GAMBOA",null,null,null,null,null,null,null,null,null,null,null,null,null,null,"LICEO TECNICO PROFESIONAL MANNHEIM",null,null,"ESCUELA REPUBLICA DE LA INDIA",null,null,"ESCUELA MUNICIPAL ISABEL RIQUELME",null,null,null,null,null,"ESCUELA GUSTAVO BISQUERTT S.",null,null,null,null,null,null,null,null,null,null,null,null,null,"PADRE ANDRE COINDRE","ESCUELA GENERAL RENE SCHNEIDER CHEREAU","ESCUELA MONTE BLANCO","ESCUELA PEUMO NEGRO",null,null,"ESCUELA MANUEL RODRIGUEZ ERDOIZA","ESCUELA SAN HERNAN",null,null,null,null,null,null,null,null,null,null,null,null,null,null,null,"ESCUELA MUNICIPAL TOQUIHUA",null,"ESCUELA MUNICIPAL DE RINCON DE YAQUIL",null,null,"ESCUELA DIFERENCIAL JUAN SANDOVAL C",null,null,null,"ESCUELA HUILQUILEMU","ESCUELA BASICA PENINSULA DE TUMBES",null,"ESCUELA LOS TRIGALES",null,null,null,null,null,null,null,"ESCUELA BASICA REPUBLICA DE PANAMA",null,null,null,null,"ESCUELA LEONARDO DA VINCI","ESCUELA REPUBLICA DE LOS E.E.U.U.","ESCUELA GASPAR CABRALES",null,null,null,"ESCUELA CARDENAL JOSE MARIA CARO"]
[9,"Falta información",null,null,null,null,null,null,null,null,null,null,null,null,null,"No",null,null,null,"CABILDO",null,null,null,null,null,null,null,null,null,null,"ESCUELA GENERAL MANUEL BAQUEDANO",null,null,"ESCUELA JORGE ALESSANDRI RODRIGUEZ",null,null,null,null,null,null,null,null,null,null,null,null,null,null,null,null,null,null,null,null,"ESCUELA REPUBLICA DE CROACIA",null,null,null,null,null,null,"ESCUELA BASICA QUILAMAPU",null,"ESCUELA MUNICIPAL",null,null,null,null,null,null,null,null,null,null,null,null,null,null,null,null,null,"ESCUELA ESTHER HUNNEUS DE CLARO","LICEO POETA FEDERICO GARCIA LORCA",null,null,null,"ESCUELA LAURA ROBLES SILVA","ESCUELA PADRE ALBERTO HURTADO CRUCHAGA","ESCUELA REPUBLICA DE FRANCIA",null,null,null,null,null,null,null,null,"ESCUELA ISLA DE MARCHANT",null,null,null,null,null,"ESCUELA NEMESIO ANTUNEZ",null,null,null,null,null,null,null,null,null,null,null,null,null,null,null,null,null,null,null,null,null,null,null,null,null,null,null,null,null,null,null,null,null,null,null,"LICEO ALTO CORDILLERA DE LA FLORIDA",null,null,null,null,null,"COLEGIO PEDRO AGUIRRE CERDA",null,null,null,null,null,null,null,null,null,null,null,"ESCUELA SAN VICTOR ALAMOS",null,null,null,null,null,null,null,null,"ESCUELA PAULA JARAQUEMADA",null,null,null,"ESCUELA BASICA REPUBLICA DE ALEMANIA",null,null,null,null,null,null,null,null,null,"LICEO REINO DE DINAMARCA",null,null,null,null,null,null,null,null,null,"ESCUELA RAMON NOGUERA PRIETO",null,null,null,null,null,null,null,null,null,null,null,null,null,null,null,"ESCUELA RURAL EMILIO SURBER SCHULZ","ESCUELA BASICA FLORENCIO ESPINOZA LOPEZ",null,null,null,null,null,null,null,null,null,null,null,null,null,null,null,null,null,null,null,null,null,null,null,null,null,null,null,null,null,null,null,null,null,null,null,null,null,null,"LICEO CIUDAD DE BRASILIA","LICEO SAN GERONIMO","ESCUELA LA COLINA",null,null,null,null,"ESCUELA PORTUGAL",null,null,null,null,null,null,null,null,null,null,null,null,null,null,null,null,null,null,null,null,"ESCUELA MUNICIPAL J.M. BALMACEDA",null,null,null,null,null,"ESCUELA LA ISLA EMMA ESCOBAR DE LAGOS",null,null,null,null,null,null,null,null,null,null,null,null,null,"PROFESOR PEDRO VIVEROS ORMENO","ESCUELA HARAS LOS CONDORES","ESCUELA NINQUIHUE","ESCUELA PUNTA DE DIAMANTE",null,null,"ESCUELA MATEO COKLJAT K","ESCUELA VILLA CENTINELA",null,null,null,null,null,null,null,null,null,null,null,null,null,null,null,"ESCUELA MUNICIPAL VINA TAGUA TAGUA",null,"ESCUELA MUNICIPAL DE SANTA CRUZ",null,null,"ESCUELA ESPECIAL SANTIAGO APOSTOL",null,null,null,"ESCUELA IN+S SYLVESTER DE ARTOZÓN","ESCUELA CORNETA CABRALES",null,"ESCUELA MANIO CHICO",null,null,null,null,null,null,null,"ESCUELA BASICA SAN CARLITOS",null,null,null,null,"ESCUELA MEXICO",null,"ESCUELA GRECIA",null,null,null,"ESCUELA DOCTOR ADRIANO MACHADO PARDO"]
[10,"Falta información",null,null,null,null,null,null,null,null,null,null,null,null,null,null,null,null,null,"CABO DE HORNOS",null,null,null,null,null,null,null,null,null,null,"ESCUELA GONZALEZ ECHEGOYEN",null,null,"ESCUELA MANUEL RODRIGUEZ ERDOYZA",null,null,null,null,null,null,null,null,null,null,null,null,null,null,null,null,null,null,null,null,"ESCUELA REPUBLICA DE ITALIA",null,null,null,null,null,null,"ESCUELA BASICA QUINCHAMALI",null,"ESCUELA MUNICIPAL",null,null,null,null,null,null,null,null,null,null,null,null,null,null,null,null,null,"ESCUELA LUIS ALFREDO MUÑOZ BURBOA","LICEO POLIV. ABDON CIFUENTES",null,null,null,"ESCUELA LOS ESTANDARTES","ESCUELA PRESIDENTE ANIBAL PINTO","ESCUELA ROSA MEDEL AGUILERA",null,null,null,null,null,null,null,null,"ESCUELA LA OBRA",null,null,null,null,null,"ESCUELA ORLANDO LETELIER",null,null,null,null,null,null,null,null,null,null,null,null,null,null,null,null,null,null,null,null,null,null,null,null,null,null,null,null,null,null,null,null,null,null,null,"LICEO ANDRES BELLO",null,null,null,null,null,"COLEGIO QUEBRADA DE TALCA",null,null,null,null,null,null,null,null,null,null,null,"ESCUELA SANTA BARBARA",null,null,null,null,null,null,null,null,"ESCUELA PEDRO ALESSANDRI VARGAS",null,null,null,"ESCUELA BASICA REPUBLICA DE ISRAEL",null,null,null,null,null,null,null,null,null,"LICEO SANTIAGO BUERAS Y AVARIA",null,null,null,null,null,null,null,null,null,"ESCUELA RAQUEL FERNANDEZ DE MORANDE",null,null,null,null,null,null,null,null,null,null,null,null,null,null,null,"ESCUELA RURAL LUZ Y SABER","ESCUELA BASICA HELENE LANG",null,null,null,null,null,null,null,null,null,null,null,null,null,null,null,null,null,null,null,null,null,null,null,null,null,null,null,null,null,null,null,null,null,null,null,null,null,null,"LICEO MONSENOR ENRIQUE ALVEAR",null,"ESCUELA LIBERTAD",null,null,null,null,"ESCUELA REPUBLICA ARGENTINA",null,null,null,null,null,null,null,null,null,null,null,null,null,null,null,null,null,null,null,null,"ESCUELA MUNICIPAL JEAN PIAGET",null,null,null,null,null,"ESCUELA LA PAZ",null,null,null,null,null,null,null,null,null,null,null,null,null,null,"ESCUELA ISABEL RIQUELME","ESCUELA RIBERA DE NUBLE","ESCUELA QUERI",null,null,"ESCUELA REPUBLICA ARGENTINA","ESCUELA WASHINGTON OMAR VENEGAS",null,null,null,null,null,null,null,null,null,null,null,null,null,null,null,"ESCUELA MUNICIPAL ZUNIGA",null,null,null,null,"ESCUELA FERNANDO ALESSANDRI RODRIGUEZ",null,null,null,"ESCUELA JOSE ABELARDO NUNEZ","ESCUELA D N¦ 475",null,"ESCUELA MANUEL RECABARREN",null,null,null,null,null,null,null,"ESCUELA BASICA VEGAS DE COLIUMO",null,null,null,null,"ESCUELA RURAL CAYUMAPU",null,"ESCUELA HERNAN OLGUIN",null,null,null,"ESCUELA DR. OSCAR MARIN SOCIAS"]
[11,"Falta información",null,null,null,null,null,null,null,null,null,null,null,null,null,null,null,null,null,"CABRERO",null,null,null,null,null,null,null,null,null,null,"ESCUELA HEROES DE LA CONCEPCION",null,null,"ESCUELA PAMPA ALGODONAL",null,null,null,null,null,null,null,null,null,null,null,null,null,null,null,null,null,null,null,null,"ESCUELA SARGENTO CANDELARIA",null,null,null,null,null,null,"ESCUELA BASICA REYES DE ESPANA",null,"ESCUELA MUNICIPAL",null,null,null,null,null,null,null,null,null,null,null,null,null,null,null,null,null,"ESCUELA OSCAR CASTRO ZUNIGA",null,null,null,null,"ESCUELA LUIS CRUZ MARTINEZ","ESCUELA REPUBLICA DE GRECIA","ESCUELA ROSA YANEZ RODRIGUEZ",null,null,null,null,null,null,null,null,"ESCUELA LOS CRISTALES",null,null,null,null,null,null,null,null,null,null,null,null,null,null,null,null,null,null,null,null,null,null,null,null,null,null,null,null,null,null,null,null,null,null,null,null,null,null,null,null,null,"LICEO INDIRA GANDHI",null,null,null,null,null,"COLEGIO VICTOR DOMINGO SILVA",null,null,null,null,null,null,null,null,null,null,null,"ESCUELA UNO ISABEL RIQUELME",null,null,null,null,null,null,null,null,"ESCUELA ROBERTO OPAZO GALVEZ",null,null,null,"ESCUELA BASICA SANTA CLARA DE CHACAYAL",null,null,null,null,null,null,null,null,null,"REPUBLICA DE GUATEMALA",null,null,null,null,null,null,null,null,null,"ESCUELA REPUBLICA DEL BRASIL",null,null,null,null,null,null,null,null,null,null,null,null,null,null,null,"ESCUELA RURAL PICHIL","ESCUELA BASICA JOSE TOMAS OVALLE B.",null,null,null,null,null,null,null,null,null,null,null,null,null,null,null,null,null,null,null,null,null,null,null,null,null,null,null,null,null,null,null,null,null,null,null,null,null,null,null,null,"ESCUELA MARCELA PAZ",null,null,null,null,"ESCUELA REPUBLICA DE CROACIA",null,null,null,null,null,null,null,null,null,null,null,null,null,null,null,null,null,null,null,null,"ESCUELA MUNICIPAL MANUEL RODRIGUEZ",null,null,null,null,null,"ESCUELA MARTA AVARIA SALVATIERRA",null,null,null,null,null,null,null,null,null,null,null,null,null,null,"ESCUELA JAVIERA CARRERA VERDUGO","ESCUELA TRES ESQUINAS","ESCUELA RAMADILLAS",null,null,"ESCUELA SAN RAFAEL",null,null,null,null,null,null,null,null,null,null,null,null,null,null,null,null,"INSTITUTO SAN VICENTE DE TAGUA TAGUA",null,null,null,null,"ESCUELA REPUBLICA DE ALEMANIA",null,null,null,"ESCUELA JUAN LUIS SANFUENTES","ESCUELA DE P-RVULOS SAN FRANCISCO",null,"ESCUELA MILLARAY",null,null,null,null,null,null,null,"ESCUELA BASICA Y ADULTOS CALIFORNIA",null,null,null,null,"ESCUELA RURAL HUELLELHUE",null,"ESCUELA JOAQUIN EDWARDS BELLO",null,null,null,"ESCUELA EDUARDO LEZANA PINCHEIRA"]
[12,"Falta información",null,null,null,null,null,null,null,null,null,null,null,null,null,null,null,null,null,"CAÑETE",null,null,null,null,null,null,null,null,null,null,"ESCUELA HUANCHACA",null,null,"ESCUELA REGIMIENTO RANCAGUA",null,null,null,null,null,null,null,null,null,null,null,null,null,null,null,null,null,null,null,null,null,null,null,null,null,null,null,"ESCUELA CAMILO HENRIQUEZ",null,"ESCUELA MUNICIPAL",null,null,null,null,null,null,null,null,null,null,null,null,null,null,null,null,null,"ESCUELA PALESTINA DE PALOMARES",null,null,null,null,"ESCUELA MANUEL RODRIGUEZ","ESCUELA SAN RAFAEL","ESCUELA ROSITA RENARD",null,null,null,null,null,null,null,null,"ESCUELA MARIA OLGA FIGUEROA LEYTON",null,null,null,null,null,null,null,null,null,null,null,null,null,null,null,null,null,null,null,null,null,null,null,null,null,null,null,null,null,null,null,null,null,null,null,null,null,null,null,null,null,"LICEO NUEVO AMANECER",null,null,null,null,null,"COLEGIO VILLA SAN BARTOLOME",null,null,null,null,null,null,null,null,null,null,null,"JANUARIO ESPINOSA",null,null,null,null,null,null,null,null,"LICEO LAURA URRUTIA BENAVENTE",null,null,null,"ESCUELA BASICA VIRQUENCO",null,null,null,null,null,null,null,null,null,null,null,null,null,null,null,null,null,null,null,"ESCUELA SAN JOSE DE LA VILLA",null,null,null,null,null,null,null,null,null,null,null,null,null,null,null,"ESCUELA RURAL WALTERIO MEYER RUSCA","ESCUELA BASICA LOS OLIVOS",null,null,null,null,null,null,null,null,null,null,null,null,null,null,null,null,null,null,null,null,null,null,null,null,null,null,null,null,null,null,null,null,null,null,null,null,null,null,null,null,"ESCUELA MIRASOL",null,null,null,null,"ESCUELA VILLA LAS NIEVES",null,null,null,null,null,null,null,null,null,null,null,null,null,null,null,null,null,null,null,null,"ESCUELA MUNICIPAL MARCELA PAZ",null,null,null,null,null,"ESCUELA REPUBLICA DE ALEMANIA",null,null,null,null,null,null,null,null,null,null,null,null,null,null,"ESCUELA JOSE NUEZ MARTIN","LICEO DIEGO PORTALES PALAZUELOS","ESCUELA SANTA ELENA",null,null,"LICEO BICENTENARIO CORDILLERA DE SAN FELIPE",null,null,null,null,null,null,null,null,null,null,null,null,null,null,null,null,null,null,null,null,null,"ESCUELA REPUBLICA DE ISRAEL",null,null,null,"ESCUELA LA FLORIDA","ESCUELA DE PARVULOS EL ARENAL",null,"ESCUELA MOLLULCO",null,null,null,null,null,null,null,"ESCUELA GABRIELA MISTRAL",null,null,null,null,"ESCUELA RURAL LOS MOLINOS",null,"ESCUELA JORGE ALESSANDRI RODRIGUEZ",null,null,null,"ESCUELA ENRIQUE CARDENAS RIVERA"]
[13,"Falta información",null,null,null,null,null,null,null,null,null,null,null,null,null,null,null,null,null,"CALAMA",null,null,null,null,null,null,null,null,null,null,"ESCUELA JOSE PAPIC RADNIC",null,null,"ESCUELA REPUBLICA DE ARGENTINA",null,null,null,null,null,null,null,null,null,null,null,null,null,null,null,null,null,null,null,null,null,null,null,null,null,null,null,"ESCUELA ESPECIAL LAS ACACIAS",null,null,null,null,null,null,null,null,null,null,null,null,null,null,null,null,null,null,null,"ESCUELA PARVULARIA BLANCA ESTELA",null,null,null,null,"ESCUELA PEDRO LEON GALLO","ESCUELA SANTO TOMAS DE AQUINO","ESCUELA VICTOR DOMINGO SILVA",null,null,null,null,null,null,null,null,"ESCUELA OSVALDO CORREA FUENZALIDA",null,null,null,null,null,null,null,null,null,null,null,null,null,null,null,null,null,null,null,null,null,null,null,null,null,null,null,null,null,null,null,null,null,null,null,null,null,null,null,null,null,"LICEO POLIVALENTE LOS ALMENDROS",null,null,null,null,null,"ESCUELA ALONSO DE ERCILLA",null,null,null,null,null,null,null,null,null,null,null,"JUAN MARTINEZ DE ROZAS",null,null,null,null,null,null,null,null,null,null,null,null,"ESCUELA BLANCO ENCALADA",null,null,null,null,null,null,null,null,null,null,null,null,null,null,null,null,null,null,null,"ESCUELA SANTA ROSA ESMERALDA",null,null,null,null,null,null,null,null,null,null,null,null,null,null,null,"ESCUELA SOCIEDAD DE SOCORRO DE SEÑORAS","ESCUELA BASICA LUCIA NUNEZ DE LA CUADRA",null,null,null,null,null,null,null,null,null,null,null,null,null,null,null,null,null,null,null,null,null,null,null,null,null,null,null,null,null,null,null,null,null,null,null,null,null,null,null,null,"ESCUELA N 10 ANGELMO",null,null,null,null,"LICEO JUAN BAUTISTA CONTARDI",null,null,null,null,null,null,null,null,null,null,null,null,null,null,null,null,null,null,null,null,"ESCUELA MUNICIPAL MARTA BRUNET",null,null,null,null,null,"ESCUELA SANTA TERESA DE AVILA",null,null,null,null,null,null,null,null,null,null,null,null,null,null,"ESCUELA L.GRAL. BERNARDO O¦HIGGINS","LICEO T+CNICO PROFESIONAL VIOLETA PARRA SANDOVAL",null,null,null,"LICEO DE NINAS CORINA URBINA",null,null,null,null,null,null,null,null,null,null,null,null,null,null,null,null,null,null,null,null,null,"LICEO REPUBLICA DE BRASIL",null,null,null,"ESCUELA LAS AMERICAS","ESCUELA F 500 HUERTOS FAMILIARES",null,"ESCUELA MUNICIPAL EL TRENCITO",null,null,null,null,null,null,null,"ESCUELA MARIANO EGANA",null,null,null,null,null,null,"ESCUELA JUAN DE SAAVEDRA",null,null,null,"ESCUELA ESPECIAL ADOLFO TANNENBAUM B."]
[14,"Falta información",null,null,null,null,null,null,null,null,null,null,null,null,null,null,null,null,null,"CALBUCO",null,null,null,null,null,null,null,null,null,null,"ESCUELA JUAN LOPEZ",null,null,"ESCUELA REPUBLICA DE FRANCIA",null,null,null,null,null,null,null,null,null,null,null,null,null,null,null,null,null,null,null,null,null,null,null,null,null,null,null,"ESCUELA GABRIELA MISTRAL",null,null,null,null,null,null,null,null,null,null,null,null,null,null,null,null,null,null,null,"LICEO DOMINGO SANTA MAR-A",null,null,null,null,"ESCUELA SAN PEDRO","ESCUELA TOMASA OLIVARES CAAMANO","ESCUELA VISTA HERMOSA",null,null,null,null,null,null,null,null,"ESCUELA PABLO NERUDA",null,null,null,null,null,null,null,null,null,null,null,null,null,null,null,null,null,null,null,null,null,null,null,null,null,null,null,null,null,null,null,null,null,null,null,null,null,null,null,null,null,null,null,null,null,null,null,"ESCUELA DE COLONIA ALFALFARES",null,null,null,null,null,null,null,null,null,null,null,"PEDRO AGUIRRE CERDA",null,null,null,null,null,null,null,null,null,null,null,null,"ESCUELA CLARA REBOLLEDO DE GODOY",null,null,null,null,null,null,null,null,null,null,null,null,null,null,null,null,null,null,null,"LICEO GABRIELA MISTRAL DE MELIPILLA",null,null,null,null,null,null,null,null,null,null,null,null,null,null,null,"ESCUELA SUIZA","ESCUELA BASICA OSCAR ARAYA MOLINA",null,null,null,null,null,null,null,null,null,null,null,null,null,null,null,null,null,null,null,null,null,null,null,null,null,null,null,null,null,null,null,null,null,null,null,null,null,null,null,null,"ESCUELA N 3 MELIPULLI",null,null,null,null,null,null,null,null,null,null,null,null,null,null,null,null,null,null,null,null,null,null,null,null,null,"ESCUELA MUNICIPAL MINERAL EL TENIENTE",null,null,null,null,null,"ESCUELA VICENTE HUIDOBRO",null,null,null,null,null,null,null,null,null,null,null,null,null,null,"ESCUELA MAHUIDA",null,null,null,null,"LICEO SAN FELIPE",null,null,null,null,null,null,null,null,null,null,null,null,null,null,null,null,null,null,null,null,null,"MIGUEL DE CERVANTES Y SAAVEDRA ANEXO A-8",null,null,null,"ESCUELA PANGUILEMO","ESCUELA REPUBLICA BOLIVARIANA DE VENEZUELA",null,"ESCUELA PEDRO DE VALDIVIA",null,null,null,null,null,null,null,null,null,null,null,null,null,null,"ESCUELA JUAN JOSE LATORRE B",null,null,null,"ESCUELA ESPECIAL JUANITA DE AGUIRRE CERDA"]
[15,"Falta información",null,null,null,null,null,null,null,null,null,null,null,null,null,null,null,null,null,"CALDERA",null,null,null,null,null,null,null,null,null,null,"ESCUELA JUAN PABLO II",null,null,"ESCUELA REPUBLICA DE ISRAEL",null,null,null,null,null,null,null,null,null,null,null,null,null,null,null,null,null,null,null,null,null,null,null,null,null,null,null,"ESCUELA LOS JARDINES DE LAUTARO",null,null,null,null,null,null,null,null,null,null,null,null,null,null,null,null,null,null,null,"LICEO LUCERO GONZALEZ",null,null,null,null,"ESCUELA VICENTE SEPULVEDA ROJO",null,null,null,null,null,null,null,null,null,null,"ESCUELA PADRE ALBERTO HURTADO",null,null,null,null,null,null,null,null,null,null,null,null,null,null,null,null,null,null,null,null,null,null,null,null,null,null,null,null,null,null,null,null,null,null,null,null,null,null,null,null,null,null,null,null,null,null,null,"ESCUELA DE EL MILAGRO",null,null,null,null,null,null,null,null,null,null,null,null,null,null,null,null,null,null,null,null,null,null,null,null,"ESCUELA COLONIA ARABE",null,null,null,null,null,null,null,null,null,null,null,null,null,null,null,null,null,null,null,"LICEO POLIV. EL BOLLENAR",null,null,null,null,null,null,null,null,null,null,null,null,null,null,null,null,"ESCUELA BASICA VALENTIN LETELIER",null,null,null,null,null,null,null,null,null,null,null,null,null,null,null,null,null,null,null,null,null,null,null,null,null,null,null,null,null,null,null,null,null,null,null,null,null,null,null,null,"ESCUELA N 5 MIRAMAR",null,null,null,null,null,null,null,null,null,null,null,null,null,null,null,null,null,null,null,null,null,null,null,null,null,"ESCUELA MUNICIPAL PATRICIO MEKIS",null,null,null,null,null,null,null,null,null,null,null,null,null,null,null,null,null,null,null,null,"ESCUELA MANUEL MAGALLANES MOURE",null,null,null,null,null,null,null,null,null,null,null,null,null,null,null,null,null,null,null,null,null,null,null,null,null,null,null,null,null,null,"ESCUELA PROSPERIDAD","ESCUELA SANTA CLARA",null,"ESCUELA SANTA ROSA",null,null,null,null,null,null,null,null,null,null,null,null,null,null,"ESCUELA JUAN WACQUEZ MOURFIN",null,null,null,"ESCUELA GASTON OSSA SAINT MARIE"]
[16,"Falta información",null,null,null,null,null,null,null,null,null,null,null,null,null,null,null,null,null,"CALERA",null,null,null,null,null,null,null,null,null,null,"ESCUELA LA BANDERA",null,null,"ESCUELA RICARDO SILVA ARRIAGADA",null,null,null,null,null,null,null,null,null,null,null,null,null,null,null,null,null,null,null,null,null,null,null,null,null,null,null,"ESCUELA MARIA AMALIA SAAVEDRA MARTINEZ",null,null,null,null,null,null,null,null,null,null,null,null,null,null,null,null,null,null,null,"LICEO REBECA MATTE BELLO",null,null,null,null,null,null,null,null,null,null,null,null,null,null,null,"ESCUELA PALESTINA",null,null,null,null,null,null,null,null,null,null,null,null,null,null,null,null,null,null,null,null,null,null,null,null,null,null,null,null,null,null,null,null,null,null,null,null,null,null,null,null,null,null,null,null,null,null,null,"ESCUELA DE ISLON",null,null,null,null,null,null,null,null,null,null,null,null,null,null,null,null,null,null,null,null,null,null,null,null,"ESCUELA CORONEL GUILLERMO MARIN CARMONA",null,null,null,null,null,null,null,null,null,null,null,null,null,null,null,null,null,null,null,null,null,null,null,null,null,null,null,null,null,null,null,null,null,null,null,null,"ESCUELA BASICA VISTA HERMOSA",null,null,null,null,null,null,null,null,null,null,null,null,null,null,null,null,null,null,null,null,null,null,null,null,null,null,null,null,null,null,null,null,null,null,null,null,null,null,null,null,"ESCUELA N 7 ARABE-SIRIA",null,null,null,null,null,null,null,null,null,null,null,null,null,null,null,null,null,null,null,null,null,null,null,null,null,"ESCUELA MUNICIPAL RENE SCHNEIDER CHEREAU",null,null,null,null,null,null,null,null,null,null,null,null,null,null,null,null,null,null,null,null,"ESCUELA PART.COMANDANTE CARLOS CONDELL",null,null,null,null,null,null,null,null,null,null,null,null,null,null,null,null,null,null,null,null,null,null,null,null,null,null,null,null,null,null,"ESCUELA SAN MIGUEL","ESCUELA SANTA LEONOR",null,"ESCUELA STANDAR",null,null,null,null,null,null,null,null,null,null,null,null,null,null,"ESCUELA MONTEDONICO",null,null,null,"ESCUELA LA PARVA"]
[17,"Falta información",null,null,null,null,null,null,null,null,null,null,null,null,null,null,null,null,null,"CALERA DE TANGO",null,null,null,null,null,null,null,null,null,null,"ESCUELA LAS AMERICAS PROFESOR JUSTO VALLADARES ORELLANA",null,null,"ESCUELA ROMULO J. PENA MATURANA",null,null,null,null,null,null,null,null,null,null,null,null,null,null,null,null,null,null,null,null,null,null,null,null,null,null,null,"ESCUELA MARTA COLVIN ANDRADE",null,null,null,null,null,null,null,null,null,null,null,null,null,null,null,null,null,null,null,"LICEO REP+BLICA DE ISRAEL",null,null,null,null,null,null,null,null,null,null,null,null,null,null,null,"ESCUELA PRESIDENTE J.M.BALMACEDA",null,null,null,null,null,null,null,null,null,null,null,null,null,null,null,null,null,null,null,null,null,null,null,null,null,null,null,null,null,null,null,null,null,null,null,null,null,null,null,null,null,null,null,null,null,null,null,"ESCUELA DE LAMBERT",null,null,null,null,null,null,null,null,null,null,null,null,null,null,null,null,null,null,null,null,null,null,null,null,"ESCUELA DIEGO PORTALES PALAZUELOS",null,null,null,null,null,null,null,null,null,null,null,null,null,null,null,null,null,null,null,null,null,null,null,null,null,null,null,null,null,null,null,null,null,null,null,null,"ESCUELA CARACHILLA",null,null,null,null,null,null,null,null,null,null,null,null,null,null,null,null,null,null,null,null,null,null,null,null,null,null,null,null,null,null,null,null,null,null,null,null,null,null,null,null,"ESCUELA N¦2 REPUBLICA ARGENTINA",null,null,null,null,null,null,null,null,null,null,null,null,null,null,null,null,null,null,null,null,null,null,null,null,null,"ESCUELA MUNICIPAL VIRGINIA BRAVO",null,null,null,null,null,null,null,null,null,null,null,null,null,null,null,null,null,null,null,null,"ESCUELA REPUBLICA DE LOS EE.UU. DE AMERICA",null,null,null,null,null,null,null,null,null,null,null,null,null,null,null,null,null,null,null,null,null,null,null,null,null,null,null,null,null,null,"ESCUELA SANTA MARTA","ESCUELA VILLA CENTINELA SUR",null,"ESCUELA VILLA ALEGRE",null,null,null,null,null,null,null,null,null,null,null,null,null,null,"ESCUELA NACIONES UNIDAS",null,null,null,"ESCUELA LIBERTADOR BERNARDO O^HIGGINS"]
[18,"Falta información",null,null,null,null,null,null,null,null,null,null,null,null,null,null,null,null,null,"CALLE LARGA",null,null,null,null,null,null,null,null,null,null,"ESCUELA PADRE GUSTAVO LE PAIGE WALQUE",null,null,"ESCUELA SUBTTE. LUIS CRUZ MARTINEZ",null,null,null,null,null,null,null,null,null,null,null,null,null,null,null,null,null,null,null,null,null,null,null,null,null,null,null,"ESCUELA PALESTINA",null,null,null,null,null,null,null,null,null,null,null,null,null,null,null,null,null,null,null,"LICEO REP+BLICA DEL ECUADOR",null,null,null,null,null,null,null,null,null,null,null,null,null,null,null,"ESCUELA RAMON FREIRE",null,null,null,null,null,null,null,null,null,null,null,null,null,null,null,null,null,null,null,null,null,null,null,null,null,null,null,null,null,null,null,null,null,null,null,null,null,null,null,null,null,null,null,null,null,null,null,"ESCUELA DE LAS ROJAS",null,null,null,null,null,null,null,null,null,null,null,null,null,null,null,null,null,null,null,null,null,null,null,null,"ESCUELA GENERAL BERNARDO O HIGGINS",null,null,null,null,null,null,null,null,null,null,null,null,null,null,null,null,null,null,null,null,null,null,null,null,null,null,null,null,null,null,null,null,null,null,null,null,"ESCUELA CERRO TAMAYA",null,null,null,null,null,null,null,null,null,null,null,null,null,null,null,null,null,null,null,null,null,null,null,null,null,null,null,null,null,null,null,null,null,null,null,null,null,null,null,null,"ESCUELA NUEVA ALERCE",null,null,null,null,null,null,null,null,null,null,null,null,null,null,null,null,null,null,null,null,null,null,null,null,null,"LICEO INTEGRADO LIBERTADOR SIMÓN BOLIVAR",null,null,null,null,null,null,null,null,null,null,null,null,null,null,null,null,null,null,null,null,"ESCUELA REPUBLICA DEL BRASIL",null,null,null,null,null,null,null,null,null,null,null,null,null,null,null,null,null,null,null,null,null,null,null,null,null,null,null,null,null,null,"ESCUELA SARGENTO 2DO DANIEL REBOLLEDO","ESCUELA VILLA INDEPENDENCIA",null,"ESCUELA VILLA CAROLINA",null,null,null,null,null,null,null,null,null,null,null,null,null,null,"ESCUELA PACIFICO",null,null,null,"ESCUELA LORD COCHRANE"]
[19,"Falta información",null,null,null,null,null,null,null,null,null,null,null,null,null,null,null,null,null,"CANELA",null,null,null,null,null,null,null,null,null,null,"ESCUELA REPUBLICA ARGENTINA",null,null,"ESCUELA TUCAPEL",null,null,null,null,null,null,null,null,null,null,null,null,null,null,null,null,null,null,null,null,null,null,null,null,null,null,null,"ESCUELA PARVULARIA FEDERICO FROEBEL",null,null,null,null,null,null,null,null,null,null,null,null,null,null,null,null,null,null,null,null,null,null,null,null,null,null,null,null,null,null,null,null,null,null,null,"ESCUELA REPUBLICA ARGENTINA",null,null,null,null,null,null,null,null,null,null,null,null,null,null,null,null,null,null,null,null,null,null,null,null,null,null,null,null,null,null,null,null,null,null,null,null,null,null,null,null,null,null,null,null,null,null,null,"ESCUELA DE ROMERO",null,null,null,null,null,null,null,null,null,null,null,null,null,null,null,null,null,null,null,null,null,null,null,null,"ESCUELA GENERAL JOSE DE SAN MARTIN",null,null,null,null,null,null,null,null,null,null,null,null,null,null,null,null,null,null,null,null,null,null,null,null,null,null,null,null,null,null,null,null,null,null,null,null,"ESCUELA CHALINGA",null,null,null,null,null,null,null,null,null,null,null,null,null,null,null,null,null,null,null,null,null,null,null,null,null,null,null,null,null,null,null,null,null,null,null,null,null,null,null,null,"ESCUELA PABLO NERUDA",null,null,null,null,null,null,null,null,null,null,null,null,null,null,null,null,null,null,null,null,null,null,null,null,null,null,null,null,null,null,null,null,null,null,null,null,null,null,null,null,null,null,null,null,null,null,"ESCUELA REPUBLICA DEL PERU",null,null,null,null,null,null,null,null,null,null,null,null,null,null,null,null,null,null,null,null,null,null,null,null,null,null,null,null,null,null,"ESCUELA UNO SAN AGUSTIN","LICEO ANITA SERRANO SEPULVEDA",null,"JARDIN INFANTIL MONTE VERDE",null,null,null,null,null,null,null,null,null,null,null,null,null,null,"ESCUELA PILOTO 1¦ LUIS PARDO VILLALON",null,null,null,"ESCUELA MARCELA PAZ"]
[20,"Falta información",null,null,null,null,null,null,null,null,null,null,null,null,null,null,null,null,null,"CARAHUE",null,null,null,null,null,null,null,null,null,null,"ESCUELA REPUBLICA DE ITALIA",null,null,"LICEO AGRICOLA JOSE ABELARDO NUNEZ M.",null,null,null,null,null,null,null,null,null,null,null,null,null,null,null,null,null,null,null,null,null,null,null,null,null,null,null,"ESCUELA PAUL HARRIS",null,null,null,null,null,null,null,null,null,null,null,null,null,null,null,null,null,null,null,null,null,null,null,null,null,null,null,null,null,null,null,null,null,null,null,"ESCUELA REPUBLICA DE BRASIL",null,null,null,null,null,null,null,null,null,null,null,null,null,null,null,null,null,null,null,null,null,null,null,null,null,null,null,null,null,null,null,null,null,null,null,null,null,null,null,null,null,null,null,null,null,null,null,"ESCUELA DE SATURNO",null,null,null,null,null,null,null,null,null,null,null,null,null,null,null,null,null,null,null,null,null,null,null,null,"ESCUELA HOGAR NIEVES VASQUEZ PALACIOS",null,null,null,null,null,null,null,null,null,null,null,null,null,null,null,null,null,null,null,null,null,null,null,null,null,null,null,null,null,null,null,null,null,null,null,null,"ESCUELA EL CRISOL",null,null,null,null,null,null,null,null,null,null,null,null,null,null,null,null,null,null,null,null,null,null,null,null,null,null,null,null,null,null,null,null,null,null,null,null,null,null,null,null,"ESCUELA PADRE ALBERTO HURTADO",null,null,null,null,null,null,null,null,null,null,null,null,null,null,null,null,null,null,null,null,null,null,null,null,null,null,null,null,null,null,null,null,null,null,null,null,null,null,null,null,null,null,null,null,null,null,"ESCUELA STA. TERESA DE LOS MORROS",null,null,null,null,null,null,null,null,null,null,null,null,null,null,null,null,null,null,null,null,null,null,null,null,null,null,null,null,null,null,"ESCUELA VILLA CULENAR",null,null,"LICEO GABRIELA MISTRAL DE TEMUCO",null,null,null,null,null,null,null,null,null,null,null,null,null,null,"ESCUELA RAMON BARROS LUCO",null,null,null,"ESCUELA ORLANDO PENA CARVAJAL"]
[21,"Falta información",null,null,null,null,null,null,null,null,null,null,null,null,null,null,null,null,null,"CARTAGENA",null,null,null,null,null,null,null,null,null,null,"ESCUELA REPUBLICA DE LOS ESTADOS UNIDOS",null,null,"PARVULARIO LAS ESPIGUITAS",null,null,null,null,null,null,null,null,null,null,null,null,null,null,null,null,null,null,null,null,null,null,null,null,null,null,null,"ESCUELA RAMÓN VINAY SEP+LVEDA",null,null,null,null,null,null,null,null,null,null,null,null,null,null,null,null,null,null,null,null,null,null,null,null,null,null,null,null,null,null,null,null,null,null,null,"ESCUELA REPUBLICA DE ITALIA",null,null,null,null,null,null,null,null,null,null,null,null,null,null,null,null,null,null,null,null,null,null,null,null,null,null,null,null,null,null,null,null,null,null,null,null,null,null,null,null,null,null,null,null,null,null,null,"ESCUELA GERMAN RIESCO",null,null,null,null,null,null,null,null,null,null,null,null,null,null,null,null,null,null,null,null,null,null,null,null,"ESCUELA ISLA DE LAJA",null,null,null,null,null,null,null,null,null,null,null,null,null,null,null,null,null,null,null,null,null,null,null,null,null,null,null,null,null,null,null,null,null,null,null,null,"ESCUELA EL TRAPICHE",null,null,null,null,null,null,null,null,null,null,null,null,null,null,null,null,null,null,null,null,null,null,null,null,null,null,null,null,null,null,null,null,null,null,null,null,null,null,null,null,"ESCUELA ROTARIO PEDRO AVELINO BRAVO",null,null,null,null,null,null,null,null,null,null,null,null,null,null,null,null,null,null,null,null,null,null,null,null,null,null,null,null,null,null,null,null,null,null,null,null,null,null,null,null,null,null,null,null,null,null,"HERNAN MERINO CORREA",null,null,null,null,null,null,null,null,null,null,null,null,null,null,null,null,null,null,null,null,null,null,null,null,null,null,null,null,null,null,"ESCUELA VILLA LA PAZ",null,null,null,null,null,null,null,null,null,null,null,null,null,null,null,null,null,"ESCUELA REPUBLICA ARABE SIRIA",null,null,null,"ESCUELA PATRICIO LYNCH Z."]
[22,"Falta información",null,null,null,null,null,null,null,null,null,null,null,null,null,null,null,null,null,"CASABLANCA",null,null,null,null,null,null,null,null,null,null,"ESCUELA ROMULO J. PENA MATURANA",null,null,null,null,null,null,null,null,null,null,null,null,null,null,null,null,null,null,null,null,null,null,null,null,null,null,null,null,null,null,"ESCUELA REPUBLICA DE ISRAEL",null,null,null,null,null,null,null,null,null,null,null,null,null,null,null,null,null,null,null,null,null,null,null,null,null,null,null,null,null,null,null,null,null,null,null,"ESCUELA REPUBLICA ESTADOS UNIDOS",null,null,null,null,null,null,null,null,null,null,null,null,null,null,null,null,null,null,null,null,null,null,null,null,null,null,null,null,null,null,null,null,null,null,null,null,null,null,null,null,null,null,null,null,null,null,null,null,null,null,null,null,null,null,null,null,null,null,null,null,null,null,null,null,null,null,null,null,null,null,null,null,"ESCUELA PEDRO RUIZ ALDEA",null,null,null,null,null,null,null,null,null,null,null,null,null,null,null,null,null,null,null,null,null,null,null,null,null,null,null,null,null,null,null,null,null,null,null,null,"ESCUELA ELVIRA DEL CARMEN OCHOA AVILES",null,null,null,null,null,null,null,null,null,null,null,null,null,null,null,null,null,null,null,null,null,null,null,null,null,null,null,null,null,null,null,null,null,null,null,null,null,null,null,null,"ESCUELA RURAL ÀPUNTILLA TENGLO",null,null,null,null,null,null,null,null,null,null,null,null,null,null,null,null,null,null,null,null,null,null,null,null,null,null,null,null,null,null,null,null,null,null,null,null,null,null,null,null,null,null,null,null,null,null,"LICEO CLARA SOLOVERA",null,null,null,null,null,null,null,null,null,null,null,null,null,null,null,null,null,null,null,null,null,null,null,null,null,null,null,null,null,null,"ESCUELA VINA PURISIMA",null,null,null,null,null,null,null,null,null,null,null,null,null,null,null,null,null,"ESCUELA REPUBLICA ARGENTINA",null,null,null,"ESCUELA PAUL HARRIS"]
[23,"Falta información",null,null,null,null,null,null,null,null,null,null,null,null,null,null,null,null,null,"CASTRO",null,null,null,null,null,null,null,null,null,null,"ESCUELA SANTIAGO AMENGUAL B.",null,null,null,null,null,null,null,null,null,null,null,null,null,null,null,null,null,null,null,null,null,null,null,null,null,null,null,null,null,null,"ESCUELA REPUBLICA DE ITALIA",null,null,null,null,null,null,null,null,null,null,null,null,null,null,null,null,null,null,null,null,null,null,null,null,null,null,null,null,null,null,null,null,null,null,null,"ESCUELA SAN ANTONIO",null,null,null,null,null,null,null,null,null,null,null,null,null,null,null,null,null,null,null,null,null,null,null,null,null,null,null,null,null,null,null,null,null,null,null,null,null,null,null,null,null,null,null,null,null,null,null,null,null,null,null,null,null,null,null,null,null,null,null,null,null,null,null,null,null,null,null,null,null,null,null,null,"ESCUELA REPUBLICA DE GRECIA",null,null,null,null,null,null,null,null,null,null,null,null,null,null,null,null,null,null,null,null,null,null,null,null,null,null,null,null,null,null,null,null,null,null,null,null,"ESCUELA GUARDIAMARINA ERNESTO RIQUELME V",null,null,null,null,null,null,null,null,null,null,null,null,null,null,null,null,null,null,null,null,null,null,null,null,null,null,null,null,null,null,null,null,null,null,null,null,null,null,null,null,"ESCUELA RURAL CORRENTOSO",null,null,null,null,null,null,null,null,null,null,null,null,null,null,null,null,null,null,null,null,null,null,null,null,null,null,null,null,null,null,null,null,null,null,null,null,null,null,null,null,null,null,null,null,null,null,"LICEO NUEVO PORVENIR",null,null,null,null,null,null,null,null,null,null,null,null,null,null,null,null,null,null,null,null,null,null,null,null,null,null,null,null,null,null,"LICEO COMPLEJO EDUCACIONAL JAVIERA CARRERA",null,null,null,null,null,null,null,null,null,null,null,null,null,null,null,null,null,"ESCUELA REPUBLICA DE EL SALVADOR",null,null,null,"ESCUELA PEDRO AGUIRRE CERDA"]
[24,"Falta información",null,null,null,null,null,null,null,null,null,null,null,null,null,null,null,null,null,"CATEMU",null,null,null,null,null,null,null,null,null,null,"INSTITUTO CIENT-FICO EDUCACIONAL JOS+ MAZA SANCHO",null,null,null,null,null,null,null,null,null,null,null,null,null,null,null,null,null,null,null,null,null,null,null,null,null,null,null,null,null,null,"ESCUELA REPUBLICA DE MEXICO",null,null,null,null,null,null,null,null,null,null,null,null,null,null,null,null,null,null,null,null,null,null,null,null,null,null,null,null,null,null,null,null,null,null,null,"ESCUELA VICTOR VERGARA CAMPOS",null,null,null,null,null,null,null,null,null,null,null,null,null,null,null,null,null,null,null,null,null,null,null,null,null,null,null,null,null,null,null,null,null,null,null,null,null,null,null,null,null,null,null,null,null,null,null,null,null,null,null,null,null,null,null,null,null,null,null,null,null,null,null,null,null,null,null,null,null,null,null,null,"ESCUELA TENIENTE IGNACIO SERRANO",null,null,null,null,null,null,null,null,null,null,null,null,null,null,null,null,null,null,null,null,null,null,null,null,null,null,null,null,null,null,null,null,null,null,null,null,"ESCUELA LOS ACACIOS",null,null,null,null,null,null,null,null,null,null,null,null,null,null,null,null,null,null,null,null,null,null,null,null,null,null,null,null,null,null,null,null,null,null,null,null,null,null,null,null,"ESCUELA RURAL HUELMO",null,null,null,null,null,null,null,null,null,null,null,null,null,null,null,null,null,null,null,null,null,null,null,null,null,null,null,null,null,null,null,null,null,null,null,null,null,null,null,null,null,null,null,null,null,null,"LICEO VALLE DE LLUTA",null,null,null,null,null,null,null,null,null,null,null,null,null,null,null,null,null,null,null,null,null,null,null,null,null,null,null,null,null,null,"LORENZO VAROLI GHERARDI",null,null,null,null,null,null,null,null,null,null,null,null,null,null,null,null,null,"ESCUELA REPUBLICA DE ISRAEL",null,null,null,"ESCUELA PRESIDENTE EDUARDO FREI MONTALVA"]
[25,"Falta información",null,null,null,null,null,null,null,null,null,null,null,null,null,null,null,null,null,"CAUQUENES",null,null,null,null,null,null,null,null,null,null,"LICEO ANDRES SABELLA",null,null,null,null,null,null,null,null,null,null,null,null,null,null,null,null,null,null,null,null,null,null,null,null,null,null,null,null,null,null,"ESCUELA REPUBLICA DE PORTUGAL",null,null,null,null,null,null,null,null,null,null,null,null,null,null,null,null,null,null,null,null,null,null,null,null,null,null,null,null,null,null,null,null,null,null,null,null,null,null,null,null,null,null,null,null,null,null,null,null,null,null,null,null,null,null,null,null,null,null,null,null,null,null,null,null,null,null,null,null,null,null,null,null,null,null,null,null,null,null,null,null,null,null,null,null,null,null,null,null,null,null,null,null,null,null,null,null,null,null,null,null,null,null,null,null,null,null,null,null,"ESCUELA THOMAS JEFFERSON",null,null,null,null,null,null,null,null,null,null,null,null,null,null,null,null,null,null,null,null,null,null,null,null,null,null,null,null,null,null,null,null,null,null,null,null,"ESCUELA LOS NOGALES",null,null,null,null,null,null,null,null,null,null,null,null,null,null,null,null,null,null,null,null,null,null,null,null,null,null,null,null,null,null,null,null,null,null,null,null,null,null,null,null,"ESCUELA RURAL LA CHAMIZA",null,null,null,null,null,null,null,null,null,null,null,null,null,null,null,null,null,null,null,null,null,null,null,null,null,null,null,null,null,null,null,null,null,null,null,null,null,null,null,null,null,null,null,null,null,null,null,null,null,null,null,null,null,null,null,null,null,null,null,null,null,null,null,null,null,null,null,null,null,null,null,null,null,null,null,null,null,null,null,null,null,null,null,null,null,null,null,null,null,null,null,null,null,null,null,"ESCUELA REPUBLICA DE MEXICO",null,null,null,"ESCUELA PRESIDENTE JOSE MANUEL BALMACEDA"]
[26,"Falta información",null,null,null,null,null,null,null,null,null,null,null,null,null,null,null,null,null,"CERRILLOS",null,null,null,null,null,null,null,null,null,null,"LICEO DE HOMBRES DE ANTOFAGASTA MARIO BAHAMONDE SILVA",null,null,null,null,null,null,null,null,null,null,null,null,null,null,null,null,null,null,null,null,null,null,null,null,null,null,null,null,null,null,"LICEO LIBERTADOR BERNARDO O`HIGGINS RIQUELME",null,null,null,null,null,null,null,null,null,null,null,null,null,null,null,null,null,null,null,null,null,null,null,null,null,null,null,null,null,null,null,null,null,null,null,null,null,null,null,null,null,null,null,null,null,null,null,null,null,null,null,null,null,null,null,null,null,null,null,null,null,null,null,null,null,null,null,null,null,null,null,null,null,null,null,null,null,null,null,null,null,null,null,null,null,null,null,null,null,null,null,null,null,null,null,null,null,null,null,null,null,null,null,null,null,null,null,null,"LICEO AGROINDUSTRIAL LLANO BLANCO",null,null,null,null,null,null,null,null,null,null,null,null,null,null,null,null,null,null,null,null,null,null,null,null,null,null,null,null,null,null,null,null,null,null,null,null,"ESCUELA MARCOS MACUADA OGALDE",null,null,null,null,null,null,null,null,null,null,null,null,null,null,null,null,null,null,null,null,null,null,null,null,null,null,null,null,null,null,null,null,null,null,null,null,null,null,null,null,"ESCUELA RURAL LA PALOMA",null,null,null,null,null,null,null,null,null,null,null,null,null,null,null,null,null,null,null,null,null,null,null,null,null,null,null,null,null,null,null,null,null,null,null,null,null,null,null,null,null,null,null,null,null,null,null,null,null,null,null,null,null,null,null,null,null,null,null,null,null,null,null,null,null,null,null,null,null,null,null,null,null,null,null,null,null,null,null,null,null,null,null,null,null,null,null,null,null,null,null,null,null,null,null,"ESCUELA REPUBLICA DEL PARAGUAY",null,null,null,"ESCUELA PRESIDENTE SALVADOR ALLENDE"]
[27,"Falta información",null,null,null,null,null,null,null,null,null,null,null,null,null,null,null,null,null,"CERRO NAVIA",null,null,null,null,null,null,null,null,null,null,"LICEO MARTA NAREA DIAZ",null,null,null,null,null,null,null,null,null,null,null,null,null,null,null,null,null,null,null,null,null,null,null,null,null,null,null,null,null,null,null,null,null,null,null,null,null,null,null,null,null,null,null,null,null,null,null,null,null,null,null,null,null,null,null,null,null,null,null,null,null,null,null,null,null,null,null,null,null,null,null,null,null,null,null,null,null,null,null,null,null,null,null,null,null,null,null,null,null,null,null,null,null,null,null,null,null,null,null,null,null,null,null,null,null,null,null,null,null,null,null,null,null,null,null,null,null,null,null,null,null,null,null,null,null,null,null,null,null,null,null,null,null,null,null,null,null,null,null,"LICEO SANTA FE",null,null,null,null,null,null,null,null,null,null,null,null,null,null,null,null,null,null,null,null,null,null,null,null,null,null,null,null,null,null,null,null,null,null,null,null,"ESCUELA MARCOS RIGOBERTO PIZARRO ARAYA",null,null,null,null,null,null,null,null,null,null,null,null,null,null,null,null,null,null,null,null,null,null,null,null,null,null,null,null,null,null,null,null,null,null,null,null,null,null,null,null,"ESCUELA RURAL LA VARA",null,null,null,null,null,null,null,null,null,null,null,null,null,null,null,null,null,null,null,null,null,null,null,null,null,null,null,null,null,null,null,null,null,null,null,null,null,null,null,null,null,null,null,null,null,null,null,null,null,null,null,null,null,null,null,null,null,null,null,null,null,null,null,null,null,null,null,null,null,null,null,null,null,null,null,null,null,null,null,null,null,null,null,null,null,null,null,null,null,null,null,null,null,null,null,"ESCUELA REPUBLICA DEL URUGUAY",null,null,null,"ESCUELA SANTA MARIA DE AGUA SANTA"]
[28,"Falta información",null,null,null,null,null,null,null,null,null,null,null,null,null,null,null,null,null,"CHAÑARAL",null,null,null,null,null,null,null,null,null,null,"REVERENDO PADRE PATRICIO CARIOLA",null,null,null,null,null,null,null,null,null,null,null,null,null,null,null,null,null,null,null,null,null,null,null,null,null,null,null,null,null,null,null,null,null,null,null,null,null,null,null,null,null,null,null,null,null,null,null,null,null,null,null,null,null,null,null,null,null,null,null,null,null,null,null,null,null,null,null,null,null,null,null,null,null,null,null,null,null,null,null,null,null,null,null,null,null,null,null,null,null,null,null,null,null,null,null,null,null,null,null,null,null,null,null,null,null,null,null,null,null,null,null,null,null,null,null,null,null,null,null,null,null,null,null,null,null,null,null,null,null,null,null,null,null,null,null,null,null,null,null,null,null,null,null,null,null,null,null,null,null,null,null,null,null,null,null,null,null,null,null,null,null,null,null,null,null,null,null,null,null,null,null,null,null,null,null,null,"ESCUELA PADRE DAMIAN HEREDIA",null,null,null,null,null,null,null,null,null,null,null,null,null,null,null,null,null,null,null,null,null,null,null,null,null,null,null,null,null,null,null,null,null,null,null,null,null,null,null,null,"ESCUELA RURAL LAGUNITAS",null,null,null,null,null,null,null,null,null,null,null,null,null,null,null,null,null,null,null,null,null,null,null,null,null,null,null,null,null,null,null,null,null,null,null,null,null,null,null,null,null,null,null,null,null,null,null,null,null,null,null,null,null,null,null,null,null,null,null,null,null,null,null,null,null,null,null,null,null,null,null,null,null,null,null,null,null,null,null,null,null,null,null,null,null,null,null,null,null,null,null,null,null,null,null,"ESCUELA SAN JUDAS TADEO",null,null,null,"ESCUELA TEODORO LOWEY"]
[29,"Falta información",null,null,null,null,null,null,null,null,null,null,null,null,null,null,null,null,null,"CHAITEN",null,null,null,null,null,null,null,null,null,null,null,null,null,null,null,null,null,null,null,null,null,null,null,null,null,null,null,null,null,null,null,null,null,null,null,null,null,null,null,null,null,null,null,null,null,null,null,null,null,null,null,null,null,null,null,null,null,null,null,null,null,null,null,null,null,null,null,null,null,null,null,null,null,null,null,null,null,null,null,null,null,null,null,null,null,null,null,null,null,null,null,null,null,null,null,null,null,null,null,null,null,null,null,null,null,null,null,null,null,null,null,null,null,null,null,null,null,null,null,null,null,null,null,null,null,null,null,null,null,null,null,null,null,null,null,null,null,null,null,null,null,null,null,null,null,null,null,null,null,null,null,null,null,null,null,null,null,null,null,null,null,null,null,null,null,null,null,null,null,null,null,null,null,null,null,null,null,null,null,null,null,null,null,null,null,null,null,"ESCUELA PEDRO ENRIQUE ALFONSO BARRIOS",null,null,null,null,null,null,null,null,null,null,null,null,null,null,null,null,null,null,null,null,null,null,null,null,null,null,null,null,null,null,null,null,null,null,null,null,null,null,null,null,"ESCUELA RURAL LENCA",null,null,null,null,null,null,null,null,null,null,null,null,null,null,null,null,null,null,null,null,null,null,null,null,null,null,null,null,null,null,null,null,null,null,null,null,null,null,null,null,null,null,null,null,null,null,null,null,null,null,null,null,null,null,null,null,null,null,null,null,null,null,null,null,null,null,null,null,null,null,null,null,null,null,null,null,null,null,null,null,null,null,null,null,null,null,null,null,null,null,null,null,null,null,null,"ESCUELA VILLA BERLIN",null,null,null,"ESCUELA UNESCO"]
[30,"Falta información",null,null,null,null,null,null,null,null,null,null,null,null,null,null,null,null,null,"CHANCO",null,null,null,null,null,null,null,null,null,null,null,null,null,null,null,null,null,null,null,null,null,null,null,null,null,null,null,null,null,null,null,null,null,null,null,null,null,null,null,null,null,null,null,null,null,null,null,null,null,null,null,null,null,null,null,null,null,null,null,null,null,null,null,null,null,null,null,null,null,null,null,null,null,null,null,null,null,null,null,null,null,null,null,null,null,null,null,null,null,null,null,null,null,null,null,null,null,null,null,null,null,null,null,null,null,null,null,null,null,null,null,null,null,null,null,null,null,null,null,null,null,null,null,null,null,null,null,null,null,null,null,null,null,null,null,null,null,null,null,null,null,null,null,null,null,null,null,null,null,null,null,null,null,null,null,null,null,null,null,null,null,null,null,null,null,null,null,null,null,null,null,null,null,null,null,null,null,null,null,null,null,null,null,null,null,null,null,"ESCUELA TABALI",null,null,null,null,null,null,null,null,null,null,null,null,null,null,null,null,null,null,null,null,null,null,null,null,null,null,null,null,null,null,null,null,null,null,null,null,null,null,null,null,"ESCUELA RURAL MAILLEN",null,null,null,null,null,null,null,null,null,null,null,null,null,null,null,null,null,null,null,null,null,null,null,null,null,null,null,null,null,null,null,null,null,null,null,null,null,null,null,null,null,null,null,null,null,null,null,null,null,null,null,null,null,null,null,null,null,null,null,null,null,null,null,null,null,null,null,null,null,null,null,null,null,null,null,null,null,null,null,null,null,null,null,null,null,null,null,null,null,null,null,null,null,null,null,"LICEO DE NINAS MARIA FRANCK DE MACDOUGAL",null,null,null,"ESCUELA VILLA INDEPENDENCIA"]
[31,"Falta información",null,null,null,null,null,null,null,null,null,null,null,null,null,null,null,null,null,"CHEPICA",null,null,null,null,null,null,null,null,null,null,null,null,null,null,null,null,null,null,null,null,null,null,null,null,null,null,null,null,null,null,null,null,null,null,null,null,null,null,null,null,null,null,null,null,null,null,null,null,null,null,null,null,null,null,null,null,null,null,null,null,null,null,null,null,null,null,null,null,null,null,null,null,null,null,null,null,null,null,null,null,null,null,null,null,null,null,null,null,null,null,null,null,null,null,null,null,null,null,null,null,null,null,null,null,null,null,null,null,null,null,null,null,null,null,null,null,null,null,null,null,null,null,null,null,null,null,null,null,null,null,null,null,null,null,null,null,null,null,null,null,null,null,null,null,null,null,null,null,null,null,null,null,null,null,null,null,null,null,null,null,null,null,null,null,null,null,null,null,null,null,null,null,null,null,null,null,null,null,null,null,null,null,null,null,null,null,null,"ESCUELA UNION CAMPESINA",null,null,null,null,null,null,null,null,null,null,null,null,null,null,null,null,null,null,null,null,null,null,null,null,null,null,null,null,null,null,null,null,null,null,null,null,null,null,null,null,"ESCUELA RURAL MAILLEN-PUQUELDON",null,null,null,null,null,null,null,null,null,null,null,null,null,null,null,null,null,null,null,null,null,null,null,null,null,null,null,null,null,null,null,null,null,null,null,null,null,null,null,null,null,null,null,null,null,null,null,null,null,null,null,null,null,null,null,null,null,null,null,null,null,null,null,null,null,null,null,null,null,null,null,null,null,null,null,null,null,null,null,null,null,null,null,null,null,null,null,null,null,null,null,null,null,null,null,"LICEO MARIA LUISA BOMBAL",null,null,null,"ESCUELA VILLA MONTE"]
[32,"Falta información",null,null,null,null,null,null,null,null,null,null,null,null,null,null,null,null,null,"CHIGUAYANTE",null,null,null,null,null,null,null,null,null,null,null,null,null,null,null,null,null,null,null,null,null,null,null,null,null,null,null,null,null,null,null,null,null,null,null,null,null,null,null,null,null,null,null,null,null,null,null,null,null,null,null,null,null,null,null,null,null,null,null,null,null,null,null,null,null,null,null,null,null,null,null,null,null,null,null,null,null,null,null,null,null,null,null,null,null,null,null,null,null,null,null,null,null,null,null,null,null,null,null,null,null,null,null,null,null,null,null,null,null,null,null,null,null,null,null,null,null,null,null,null,null,null,null,null,null,null,null,null,null,null,null,null,null,null,null,null,null,null,null,null,null,null,null,null,null,null,null,null,null,null,null,null,null,null,null,null,null,null,null,null,null,null,null,null,null,null,null,null,null,null,null,null,null,null,null,null,null,null,null,null,null,null,null,null,null,null,null,null,null,null,null,null,null,null,null,null,null,null,null,null,null,null,null,null,null,null,null,null,null,null,null,null,null,null,null,null,null,null,null,null,null,null,null,null,null,null,null,null,"ESCUELA RURAL PELLUCO",null,null,null,null,null,null,null,null,null,null,null,null,null,null,null,null,null,null,null,null,null,null,null,null,null,null,null,null,null,null,null,null,null,null,null,null,null,null,null,null,null,null,null,null,null,null,null,null,null,null,null,null,null,null,null,null,null,null,null,null,null,null,null,null,null,null,null,null,null,null,null,null,null,null,null,null,null,null,null,null,null,null,null,null,null,null,null,null,null,null,null,null,null,null,null,"LICEO MATILDE BRANDAU DE ROSS",null,null,null,"ESCUELA VIOLETA PARRA"]
[33,"Falta información",null,null,null,null,null,null,null,null,null,null,null,null,null,null,null,null,null,"CHILE CHICO",null,null,null,null,null,null,null,null,null,null,null,null,null,null,null,null,null,null,null,null,null,null,null,null,null,null,null,null,null,null,null,null,null,null,null,null,null,null,null,null,null,null,null,null,null,null,null,null,null,null,null,null,null,null,null,null,null,null,null,null,null,null,null,null,null,null,null,null,null,null,null,null,null,null,null,null,null,null,null,null,null,null,null,null,null,null,null,null,null,null,null,null,null,null,null,null,null,null,null,null,null,null,null,null,null,null,null,null,null,null,null,null,null,null,null,null,null,null,null,null,null,null,null,null,null,null,null,null,null,null,null,null,null,null,null,null,null,null,null,null,null,null,null,null,null,null,null,null,null,null,null,null,null,null,null,null,null,null,null,null,null,null,null,null,null,null,null,null,null,null,null,null,null,null,null,null,null,null,null,null,null,null,null,null,null,null,null,null,null,null,null,null,null,null,null,null,null,null,null,null,null,null,null,null,null,null,null,null,null,null,null,null,null,null,null,null,null,null,null,null,null,null,null,null,null,null,null,null,"ESCUELA RURAL TEPUAL",null,null,null,null,null,null,null,null,null,null,null,null,null,null,null,null,null,null,null,null,null,null,null,null,null,null,null,null,null,null,null,null,null,null,null,null,null,null,null,null,null,null,null,null,null,null,null,null,null,null,null,null,null,null,null,null,null,null,null,null,null,null,null,null,null,null,null,null,null,null,null,null,null,null,null,null,null,null,null,null,null,null,null,null,null,null,null,null,null,null,null,null,null,null,null,"LICEO TECNOLÓGICO ALFREDO NAZAR FERES",null,null,null,"INST.DEL DISCAP.VISUAL ANTONIO MOSQUETE"]
[34,"Falta información",null,null,null,null,null,null,null,null,null,null,null,null,null,null,null,null,null,"CHILLAN",null,null,null,null,null,null,null,null,null,null,null,null,null,null,null,null,null,null,null,null,null,null,null,null,null,null,null,null,null,null,null,null,null,null,null,null,null,null,null,null,null,null,null,null,null,null,null,null,null,null,null,null,null,null,null,null,null,null,null,null,null,null,null,null,null,null,null,null,null,null,null,null,null,null,null,null,null,null,null,null,null,null,null,null,null,null,null,null,null,null,null,null,null,null,null,null,null,null,null,null,null,null,null,null,null,null,null,null,null,null,null,null,null,null,null,null,null,null,null,null,null,null,null,null,null,null,null,null,null,null,null,null,null,null,null,null,null,null,null,null,null,null,null,null,null,null,null,null,null,null,null,null,null,null,null,null,null,null,null,null,null,null,null,null,null,null,null,null,null,null,null,null,null,null,null,null,null,null,null,null,null,null,null,null,null,null,null,null,null,null,null,null,null,null,null,null,null,null,null,null,null,null,null,null,null,null,null,null,null,null,null,null,null,null,null,null,null,null,null,null,null,null,null,null,null,null,null,null,"ESCUELA RURAL TRAPEN"]
[35,"Falta información",null,null,null,null,null,null,null,null,null,null,null,null,null,null,null,null,null,"CHILLAN VIEJO",null,null,null,null,null,null,null,null,null,null,null,null,null,null,null,null,null,null,null,null,null,null,null,null,null,null,null,null,null,null,null,null,null,null,null,null,null,null,null,null,null,null,null,null,null,null,null,null,null,null,null,null,null,null,null,null,null,null,null,null,null,null,null,null,null,null,null,null,null,null,null,null,null,null,null,null,null,null,null,null,null,null,null,null,null,null,null,null,null,null,null,null,null,null,null,null,null,null,null,null,null,null,null,null,null,null,null,null,null,null,null,null,null,null,null,null,null,null,null,null,null,null,null,null,null,null,null,null,null,null,null,null,null,null,null,null,null,null,null,null,null,null,null,null,null,null,null,null,null,null,null,null,null,null,null,null,null,null,null,null,null,null,null,null,null,null,null,null,null,null,null,null,null,null,null,null,null,null,null,null,null,null,null,null,null,null,null,null,null,null,null,null,null,null,null,null,null,null,null,null,null,null,null,null,null,null,null,null,null,null,null,null,null,null,null,null,null,null,null,null,null,null,null,null,null,null,null,null,"LICEO RURAL LAS QUEMAS"]
[36,"Falta información",null,null,null,null,null,null,null,null,null,null,null,null,null,null,null,null,null,"CHIMBARONGO",null,null,null,null,null,null,null,null,null,null,null,null,null,null,null,null,null,null,null,null,null,null,null,null,null,null,null,null,null,null,null,null,null,null,null,null,null,null,null,null,null,null,null,null,null,null,null,null,null,null,null,null,null,null,null,null,null,null,null,null,null,null,null,null,null,null,null,null,null,null,null,null,null,null,null,null,null,null,null,null,null,null,null,null,null,null,null,null,null,null,null,null,null,null,null,null,null,null,null,null,null,null,null,null,null,null,null,null,null,null,null,null,null,null,null,null,null,null,null,null,null,null,null,null,null,null,null,null,null,null,null,null,null,null,null,null,null,null,null,null,null,null,null,null,null,null,null,null,null,null,null,null,null,null,null,null,null,null,null,null,null,null,null,null,null,null,null,null,null,null,null,null,null,null,null,null,null,null,null,null,null,null,null,null,null,null,null,null,null,null,null,null,null,null,null,null,null,null,null,null,null,null,null,null,null,null,null,null,null,null,null,null,null,null,null,null,null,null,null,null,null,null,null,null,null,null,null,null,"LICEO RURAL PIEDRA AZUL"]
[37,"Falta información",null,null,null,null,null,null,null,null,null,null,null,null,null,null,null,null,null,"CHOLCHOL"]
[38,"Falta información",null,null,null,null,null,null,null,null,null,null,null,null,null,null,null,null,null,"CHONCHI"]
[39,"Falta información",null,null,null,null,null,null,null,null,null,null,null,null,null,null,null,null,null,"CISNES"]
[40,"Falta información",null,null,null,null,null,null,null,null,null,null,null,null,null,null,null,null,null,"COBQUECURA"]
[41,"Falta información",null,null,null,null,null,null,null,null,null,null,null,null,null,null,null,null,null,"COCHAMO"]
[42,"Falta información",null,null,null,null,null,null,null,null,null,null,null,null,null,null,null,null,null,"COCHRANE"]
[43,"Falta información",null,null,null,null,null,null,null,null,null,null,null,null,null,null,null,null,null,"CODEGUA"]
[44,"Falta información",null,null,null,null,null,null,null,null,null,null,null,null,null,null,null,null,null,"COELEMU"]
[45,"Falta información",null,null,null,null,null,null,null,null,null,null,null,null,null,null,null,null,null,"COIHAIQUE"]
[46,"Falta información",null,null,null,null,null,null,null,null,null,null,null,null,null,null,null,null,null,"COIHUECO"]
[47,"Falta información",null,null,null,null,null,null,null,null,null,null,null,null,null,null,null,null,null,"COINCO"]
[48,"Falta información",null,null,null,null,null,null,null,null,null,null,null,null,null,null,null,null,null,"COLBUN"]
[49,"Falta información",null,null,null,null,null,null,null,null,null,null,null,null,null,null,null,null,null,"COLCHANE"]
[50,"Falta información",null,null,null,null,null,null,null,null,null,null,null,null,null,null,null,null,null,"COLINA"]
[51,"Falta información",null,null,null,null,null,null,null,null,null,null,null,null,null,null,null,null,null,"COLLIPULLI"]
[52,"Falta información",null,null,null,null,null,null,null,null,null,null,null,null,null,null,null,null,null,"COLTAUCO"]
[53,"Falta información",null,null,null,null,null,null,null,null,null,null,null,null,null,null,null,null,null,"COMBARBALA"]
[54,"Falta información",null,null,null,null,null,null,null,null,null,null,null,null,null,null,null,null,null,"CONCEPCION"]
[55,"Falta información",null,null,null,null,null,null,null,null,null,null,null,null,null,null,null,null,null,"CONCHALI"]
[56,"Falta información",null,null,null,null,null,null,null,null,null,null,null,null,null,null,null,null,null,"CONCON"]
[57,"Falta información",null,null,null,null,null,null,null,null,null,null,null,null,null,null,null,null,null,"CONSTITUCION"]
[58,"Falta información",null,null,null,null,null,null,null,null,null,null,null,null,null,null,null,null,null,"CONTULMO"]
[59,"Falta información",null,null,null,null,null,null,null,null,null,null,null,null,null,null,null,null,null,"COPIAPO"]
[60,"Falta información",null,null,null,null,null,null,null,null,null,null,null,null,null,null,null,null,null,"COQUIMBO"]
[61,"Falta información",null,null,null,null,null,null,null,null,null,null,null,null,null,null,null,null,null,"CORONEL"]
[62,"Falta información",null,null,null,null,null,null,null,null,null,null,null,null,null,null,null,null,null,"CORRAL"]
[63,"Falta información",null,null,null,null,null,null,null,null,null,null,null,null,null,null,null,null,null,"CUNCO"]
[64,"Falta información",null,null,null,null,null,null,null,null,null,null,null,null,null,null,null,null,null,"CURACAUTIN"]
[65,"Falta información",null,null,null,null,null,null,null,null,null,null,null,null,null,null,null,null,null,"CURACAVI"]
[66,{"$f":"IF(E74=\"No\",IF(COUNTBLANK(C74:M74)=0,\"Completo\",IF(COUNTBLANK(C74:M74)=10,\"\",\"Falta información\")),IF(E74=\"Si\",IF(COUNTBLANK(C74:M74)=4,\"Completo\",IF(COUNTBLANK(C74:M74)=10,\"\",\"Falta información\")),\"Falta información\"))","v":"Falta información"},null,null,null,null,null,null,null,null,null,null,null,null,null,null,null,null,null,"CURACO DE VELEZ"]
[67,"Falta información",null,null,null,null,null,null,null,null,null,null,null,null,null,null,null,null,null,"CURANILAHUE"]
[68,"Falta información",null,null,null,null,null,null,null,null,null,null,null,null,null,null,null,null,null,"CURARREHUE"]
[69,"Falta información",null,null,null,null,null,null,null,null,null,null,null,null,null,null,null,null,null,"CUREPTO"]
[70,"Falta información",null,null,null,null,null,null,null,null,null,null,null,null,null,null,null,null,null,"CURICO"]
[71,"Falta información",null,null,null,null,null,null,null,null,null,null,null,null,null,null,null,null,null,"DALCAHUE"]
[72,"Falta información",null,null,null,null,null,null,null,null,null,null,null,null,null,null,null,null,null,"DIEGO DE ALMAGRO"]
[73,"Falta información",null,null,null,null,null,null,null,null,null,null,null,null,null,null,null,null,null,"ÑIQUEN"]
[74,"Falta información",null,null,null,null,null,null,null,null,null,null,null,null,null,null,null,null,null,"DOÑIHUE"]
[75,"Falta información",null,null,null,null,null,null,null,null,null,null,null,null,null,null,null,null,null,"ÑUÑOA"]
[76,"Falta información",null,null,null,null,null,null,null,null,null,null,null,null,null,null,null,null,null,"EL BOSQUE"]
[77,"Falta información",null,null,null,null,null,null,null,null,null,null,null,null,null,null,null,null,null,"EL CARMEN"]
[78,"Falta información",null,null,null,null,null,null,null,null,null,null,null,null,null,null,null,null,null,"EL MONTE"]
[79,"Falta información",null,null,null,null,null,null,null,null,null,null,null,null,null,null,null,null,null,"EL QUISCO"]
[80,"Falta información",null,null,null,null,null,null,null,null,null,null,null,null,null,null,null,null,null,"EL TABO"]
[81,"Falta información",null,null,null,null,null,null,null,null,null,null,null,null,null,null,null,null,null,"EMPEDRADO"]
[82,"Falta información",null,null,null,null,null,null,null,null,null,null,null,null,null,null,null,null,null,"ERCILLA"]
[83,"Falta información",null,null,null,null,null,null,null,null,null,null,null,null,null,null,null,null,null,"ESTACION CENTRAL"]
[84,"Falta información",null,null,null,null,null,null,null,null,null,null,null,null,null,null,null,null,null,"FLORIDA"]
[85,"Falta información",null,null,null,null,null,null,null,null,null,null,null,null,null,null,null,null,null,"FREIRE"]
[86,"Falta información",null,null,null,null,null,null,null,null,null,null,null,null,null,null,null,null,null,"FREIRINA"]
[87,"Falta información",null,null,null,null,null,null,null,null,null,null,null,null,null,null,null,null,null,"FRESIA"]
[88,"Falta información",null,null,null,null,null,null,null,null,null,null,null,null,null,null,null,null,null,"FRUTILLAR"]
[89,"Falta información",null,null,null,null,null,null,null,null,null,null,null,null,null,null,null,null,null,"FUTALEUFU"]
[90,"Falta información",null,null,null,null,null,null,null,null,null,null,null,null,null,null,null,null,null,"FUTRONO"]
[91,"Falta información",null,null,null,null,null,null,null,null,null,null,null,null,null,null,null,null,null,"GALVARINO"]
[92,"Falta información",null,null,null,null,null,null,null,null,null,null,null,null,null,null,null,null,null,"GORBEA"]
[93,"Falta información",null,null,null,null,null,null,null,null,null,null,null,null,null,null,null,null,null,"GRANEROS"]
[94,"Falta información",null,null,null,null,null,null,null,null,null,null,null,null,null,null,null,null,null,"GUAITECAS"]
[95,"Falta información",null,null,null,null,null,null,null,null,null,null,null,null,null,null,null,null,null,"HIJUELAS"]
[96,"Falta información",null,null,null,null,null,null,null,null,null,null,null,null,null,null,null,null,null,"HUALAÑE"]
[97,"Falta información",null,null,null,null,null,null,null,null,null,null,null,null,null,null,null,null,null,"HUALAIHUE"]
[98,"Falta información",null,null,null,null,null,null,null,null,null,null,null,null,null,null,null,null,null,"HUALPEN"]
[99,"Falta información",null,null,null,null,null,null,null,null,null,null,null,null,null,null,null,null,null,"HUALQUI"]
[100,"Falta información",null,null,null,null,null,null,null,null,null,null,null,null,null,null,null,null,null,"HUARA"]
[101,"Falta información",null,null,null,null,null,null,null,null,null,null,null,null,null,null,null,null,null,"HUASCO"]
[102,"Falta información",null,null,null,null,null,null,null,null,null,null,null,null,null,null,null,null,null,"HUECHURABA"]
[103,"Falta información",null,null,null,null,null,null,null,null,null,null,null,null,null,null,null,null,null,"ILLAPEL"]
[104,"Falta información",null,null,null,null,null,null,null,null,null,null,null,null,null,null,null,null,null,"INDEPENDENCIA"]
[105,"Falta información",null,null,null,null,null,null,null,null,null,null,null,null,null,null,null,null,null,"IQUIQUE"]
[106,"Falta información",null,null,null,null,null,null,null,null,null,null,null,null,null,null,null,null,null,"ISLA DE MAIPO"]
[107,"Falta información",null,null,null,null,null,null,null,null,null,null,null,null,null,null,null,null,null,"ISLA DE PASCUA"]
[108,"Falta información",null,null,null,null,null,null,null,null,null,null,null,null,null,null,null,null,null,"JUAN FERNANDEZ"]
[109,"Falta información",null,null,null,null,null,null,null,null,null,null,null,null,null,null,null,null,null,"LA CISTERNA"]
[110,"Falta información",null,null,null,null,null,null,null,null,null,null,null,null,null,null,null,null,null,"LA CRUZ"]
[111,"Falta información",null,null,null,null,null,null,null,null,null,null,null,null,null,null,null,null,null,"LA ESTRELLA"]
[112,"Falta información",null,null,null,null,null,null,null,null,null,null,null,null,null,null,null,null,null,"LA FLORIDA"]
[113,"Falta información",null,null,null,null,null,null,null,null,null,null,null,null,null,null,null,null,null,"LA GRANJA"]
[114,"Falta información",null,null,null,null,null,null,null,null,null,null,null,null,null,null,null,null,null,"LA HIGUERA"]
[115,"Falta información",null,null,null,null,null,null,null,null,null,null,null,null,null,null,null,null,null,"LA LIGUA"]
[116,"Falta información",null,null,null,null,null,null,null,null,null,null,null,null,null,null,null,null,null,"LA PINTANA"]
[117,"Falta información",null,null,null,null,null,null,null,null,null,null,null,null,null,null,null,null,null,"LA REINA"]
[118,"Falta información",null,null,null,null,null,null,null,null,null,null,null,null,null,null,null,null,null,"LA SERENA"]
[119,"Falta información",null,null,null,null,null,null,null,null,null,null,null,null,null,null,null,null,null,"LA UNION"]
[120,"Falta información",null,null,null,null,null,null,null,null,null,null,null,null,null,null,null,null,null,"LAGO RANCO"]
[121,"Falta información",null,null,null,null,null,null,null,null,null,null,null,null,null,null,null,null,null,"LAJA"]
[122,"Falta información",null,null,null,null,null,null,null,null,null,null,null,null,null,null,null,null,null,"LAMPA"]
[123,"Falta información",null,null,null,null,null,null,null,null,null,null,null,null,null,null,null,null,null,"LANCO"]
[124,"Falta información",null,null,null,null,null,null,null,null,null,null,null,null,null,null,null,null,null,"LAS CABRAS"]
[125,"Falta información",null,null,null,null,null,null,null,null,null,null,null,null,null,null,null,null,null,"LAS CONDES"]
[126,"Falta información",null,null,null,null,null,null,null,null,null,null,null,null,null,null,null,null,null,"LAUTARO"]
[127,"Falta información",null,null,null,null,null,null,null,null,null,null,null,null,null,null,null,null,null,"LEBU"]
[128,"Falta información",null,null,null,null,null,null,null,null,null,null,null,null,null,null,null,null,null,"LICANTEN"]
[129,"Falta información",null,null,null,null,null,null,null,null,null,null,null,null,null,null,null,null,null,"LIMACHE"]
[130,{"$f":"IF(E138=\"No\",IF(COUNTBLANK(C138:M138)=0,\"Completo\",IF(COUNTBLANK(C138:M138)=10,\"\",\"Falta información\")),IF(E138=\"Si\",IF(COUNTBLANK(C138:M138)=4,\"Completo\",IF(COUNTBLANK(C138:M138)=10,\"\",\"Falta información\")),\"Falta información\"))","v":"Falta información"},null,null,null,null,null,null,null,null,null,null,null,null,null,null,null,null,null,"LINARES"]
[131,"Falta información",null,null,null,null,null,null,null,null,null,null,null,null,null,null,null,null,null,"LITUECHE"]
[132,"Falta información",null,null,null,null,null,null,null,null,null,null,null,null,null,null,null,null,null,"LLAILLAY"]
[133,"Falta información",null,null,null,null,null,null,null,null,null,null,null,null,null,null,null,null,null,"LLANQUIHUE"]
[134,"Falta información",null,null,null,null,null,null,null,null,null,null,null,null,null,null,null,null,null,"LO BARNECHEA"]
[135,"Falta información",null,null,null,null,null,null,null,null,null,null,null,null,null,null,null,null,null,"LO ESPEJO"]
[136,"Falta información",null,null,null,null,null,null,null,null,null,null,null,null,null,null,null,null,null,"LO PRADO"]
[137,"Falta información",null,null,null,null,null,null,null,null,null,null,null,null,null,null,null,null,null,"LOLOL"]
[138,"Falta información",null,null,null,null,null,null,null,null,null,null,null,null,null,null,null,null,null,"LONCOCHE"]
[139,"Falta información",null,null,null,null,null,null,null,null,null,null,null,null,null,null,null,null,null,"LONGAVI"]
[140,"Falta información",null,null,null,null,null,null,null,null,null,null,null,null,null,null,null,null,null,"LONQUIMAY"]
[141,"Falta información",null,null,null,null,null,null,null,null,null,null,null,null,null,null,null,null,null,"LOS ALAMOS"]
[142,"Falta información",null,null,null,null,null,null,null,null,null,null,null,null,null,null,null,null,null,"LOS ANDES"]
[143,"Falta información",null,null,null,null,null,null,null,null,null,null,null,null,null,null,null,null,null,"LOS ANGELES"]
[144,"Falta información",null,null,null,null,null,null,null,null,null,null,null,null,null,null,null,null,null,"LOS LAGOS"]
[145,"Falta información",null,null,null,null,null,null,null,null,null,null,null,null,null,null,null,null,null,"LOS MUERMOS"]
[146,"Falta información",null,null,null,null,null,null,null,null,null,null,null,null,null,null,null,null,null,"LOS SAUCES"]
[147,"Falta información",null,null,null,null,null,null,null,null,null,null,null,null,null,null,null,null,null,"LOS VILOS"]
[148,"Falta información",null,null,null,null,null,null,null,null,null,null,null,null,null,null,null,null,null,"LOTA"]
[149,"Falta información",null,null,null,null,null,null,null,null,null,null,null,null,null,null,null,null,null,"LUMACO"]
[150,"Falta información",null,null,null,null,null,null,null,null,null,null,null,null,null,null,null,null,null,"MACHALI"]
[151,"Falta información",null,null,null,null,null,null,null,null,null,null,null,null,null,null,null,null,null,"MACUL"]
[152,"Falta información",null,null,null,null,null,null,null,null,null,null,null,null,null,null,null,null,null,"MAFIL"]
[153,"Falta información",null,null,null,null,null,null,null,null,null,null,null,null,null,null,null,null,null,"MAIPU"]
[154,"Falta información",null,null,null,null,null,null,null,null,null,null,null,null,null,null,null,null,null,"MALLOA"]
[155,"Falta información",null,null,null,null,null,null,null,null,null,null,null,null,null,null,null,null,null,"MARCHIHUE"]
[156,"Falta información",null,null,null,null,null,null,null,null,null,null,null,null,null,null,null,null,null,"MARIA ELENA"]
[157,"Falta información",null,null,null,null,null,null,null,null,null,null,null,null,null,null,null,null,null,"MARIA PINTO"]
[158,"Falta información",null,null,null,null,null,null,null,null,null,null,null,null,null,null,null,null,null,"MARIQUINA"]
[159,"Falta información",null,null,null,null,null,null,null,null,null,null,null,null,null,null,null,null,null,"MAULE"]
[160,"Falta información",null,null,null,null,null,null,null,null,null,null,null,null,null,null,null,null,null,"MAULLIN"]
[161,"Falta información",null,null,null,null,null,null,null,null,null,null,null,null,null,null,null,null,null,"MEJILLONES"]
[162,"Falta información",null,null,null,null,null,null,null,null,null,null,null,null,null,null,null,null,null,"MELIPEUCO"]
[163,"Falta información",null,null,null,null,null,null,null,null,null,null,null,null,null,null,null,null,null,"MELIPILLA"]
[164,"Falta información",null,null,null,null,null,null,null,null,null,null,null,null,null,null,null,null,null,"MOLINA"]
[165,"Falta información",null,null,null,null,null,null,null,null,null,null,null,null,null,null,null,null,null,"MONTE PATRIA"]
[166,"Falta información",null,null,null,null,null,null,null,null,null,null,null,null,null,null,null,null,null,"MOSTAZAL"]
[167,"Falta información",null,null,null,null,null,null,null,null,null,null,null,null,null,null,null,null,null,"MULCHEN"]
[168,"Falta información",null,null,null,null,null,null,null,null,null,null,null,null,null,null,null,null,null,"NACIMIENTO"]
[169,"Falta información",null,null,null,null,null,null,null,null,null,null,null,null,null,null,null,null,null,"NANCAGUA"]
[170,"Falta información",null,null,null,null,null,null,null,null,null,null,null,null,null,null,null,null,null,"NATALES"]
[171,"Falta información",null,null,null,null,null,null,null,null,null,null,null,null,null,null,null,null,null,"NAVIDAD"]
[172,"Falta información",null,null,null,null,null,null,null,null,null,null,null,null,null,null,null,null,null,"NEGRETE"]
[173,"Falta información",null,null,null,null,null,null,null,null,null,null,null,null,null,null,null,null,null,"NINHUE"]
[174,"Falta información",null,null,null,null,null,null,null,null,null,null,null,null,null,null,null,null,null,"NOGALES"]
[175,"Falta información",null,null,null,null,null,null,null,null,null,null,null,null,null,null,null,null,null,"NUEVA IMPERIAL"]
[176,"Falta información",null,null,null,null,null,null,null,null,null,null,null,null,null,null,null,null,null,"O'HIGGINS"]
[177,"Falta información",null,null,null,null,null,null,null,null,null,null,null,null,null,null,null,null,null,"OLIVAR"]
[178,"Falta información",null,null,null,null,null,null,null,null,null,null,null,null,null,null,null,null,null,"OLMUE"]
[179,"Falta información",null,null,null,null,null,null,null,null,null,null,null,null,null,null,null,null,null,"OSORNO"]
[180,"Falta información",null,null,null,null,null,null,null,null,null,null,null,null,null,null,null,null,null,"OVALLE"]
[181,"Falta información",null,null,null,null,null,null,null,null,null,null,null,null,null,null,null,null,null,"PADRE HURTADO"]
[182,"Falta información",null,null,null,null,null,null,null,null,null,null,null,null,null,null,null,null,null,"PADRE LAS CASAS"]
[183,"Falta información",null,null,null,null,null,null,null,null,null,null,null,null,null,null,null,null,null,"PAIGUANO"]
[184,"Falta información",null,null,null,null,null,null,null,null,null,null,null,null,null,null,null,null,null,"PAILLACO"]
[185,"Falta información",null,null,null,null,null,null,null,null,null,null,null,null,null,null,null,null,null,"PAINE"]
[186,"Falta información",null,null,null,null,null,null,null,null,null,null,null,null,null,null,null,null,null,"PALENA"]
[187,"Falta información",null,null,null,null,null,null,null,null,null,null,null,null,null,null,null,null,null,"PALMILLA"]
[188,"Falta información",null,null,null,null,null,null,null,null,null,null,null,null,null,null,null,null,null,"PANGUIPULLI"]
[189,"Falta información",null,null,null,null,null,null,null,null,null,null,null,null,null,null,null,null,null,"PANQUEHUE"]
[190,"Falta información",null,null,null,null,null,null,null,null,null,null,null,null,null,null,null,null,null,"PAPUDO"]
[191,"Falta información",null,null,null,null,null,null,null,null,null,null,null,null,null,null,null,null,null,"PAREDONES"]
[192,"Falta información",null,null,null,null,null,null,null,null,null,null,null,null,null,null,null,null,null,"PARRAL"]
[193,"Falta información",null,null,null,null,null,null,null,null,null,null,null,null,null,null,null,null,null,"PEÑAFLOR"]
[194,{"$f":"IF(E202=\"No\",IF(COUNTBLANK(C202:M202)=0,\"Completo\",IF(COUNTBLANK(C202:M202)=10,\"\",\"Falta información\")),IF(E202=\"Si\",IF(COUNTBLANK(C202:M202)=4,\"Completo\",IF(COUNTBLANK(C202:M202)=10,\"\",\"Falta información\")),\"Falta información\"))","v":"Falta información"},null,null,null,null,null,null,null,null,null,null,null,null,null,null,null,null,null,"PEÑALOLEN"]
[195,"Falta información",null,null,null,null,null,null,null,null,null,null,null,null,null,null,null,null,null,"PEDRO AGUIRRE CERDA"]
[196,"Falta información",null,null,null,null,null,null,null,null,null,null,null,null,null,null,null,null,null,"PELARCO"]
[197,"Falta información",null,null,null,null,null,null,null,null,null,null,null,null,null,null,null,null,null,"PELLUHUE"]
[198,"Falta información",null,null,null,null,null,null,null,null,null,null,null,null,null,null,null,null,null,"PEMUCO"]
[199,"Falta información",null,null,null,null,null,null,null,null,null,null,null,null,null,null,null,null,null,"PENCAHUE"]
[200,"Falta información",null,null,null,null,null,null,null,null,null,null,null,null,null,null,null,null,null,"PENCO"]
[201,"Falta información",null,null,null,null,null,null,null,null,null,null,null,null,null,null,null,null,null,"PERALILLO"]
[202,"Falta información",null,null,null,null,null,null,null,null,null,null,null,null,null,null,null,null,null,"PERQUENCO"]
[203,"Falta información",null,null,null,null,null,null,null,null,null,null,null,null,null,null,null,null,null,"PETORCA"]
[204,"Falta información",null,null,null,null,null,null,null,null,null,null,null,null,null,null,null,null,null,"PEUMO"]
[205,"Falta información",null,null,null,null,null,null,null,null,null,null,null,null,null,null,null,null,null,"PICA"]
[206,"Falta información",null,null,null,null,null,null,null,null,null,null,null,null,null,null,null,null,null,"PICHIDEGUA"]
[207,"Falta información",null,null,null,null,null,null,null,null,null,null,null,null,null,null,null,null,null,"PICHILEMU"]
[208,"Falta información",null,null,null,null,null,null,null,null,null,null,null,null,null,null,null,null,null,"PINTO"]
[209,"Falta información",null,null,null,null,null,null,null,null,null,null,null,null,null,null,null,null,null,"PIRQUE"]
[210,"Falta información",null,null,null,null,null,null,null,null,null,null,null,null,null,null,null,null,null,"PITRUFQUEN"]
[211,"Falta información",null,null,null,null,null,null,null,null,null,null,null,null,null,null,null,null,null,"PLACILLA"]
[212,"Falta información",null,null,null,null,null,null,null,null,null,null,null,null,null,null,null,null,null,"PORTEZUELO"]
[213,"Falta información",null,null,null,null,null,null,null,null,null,null,null,null,null,null,null,null,null,"PORVENIR"]
[214,"Falta información",null,null,null,null,null,null,null,null,null,null,null,null,null,null,null,null,null,"POZO ALMONTE"]
[215,"Falta información",null,null,null,null,null,null,null,null,null,null,null,null,null,null,null,null,null,"PRIMAVERA"]
[216,"Falta información",null,null,null,null,null,null,null,null,null,null,null,null,null,null,null,null,null,"PROVIDENCIA"]
[217,"Falta información",null,null,null,null,null,null,null,null,null,null,null,null,null,null,null,null,null,"PUCHUNCAVI"]
[218,"Falta información",null,null,null,null,null,null,null,null,null,null,null,null,null,null,null,null,null,"PUCON"]
[219,"Falta información",null,null,null,null,null,null,null,null,null,null,null,null,null,null,null,null,null,"PUDAHUEL"]
[220,"Falta información",null,null,null,null,null,null,null,null,null,null,null,null,null,null,null,null,null,"PUENTE ALTO"]
[221,"Falta información",null,null,null,null,null,null,null,null,null,null,null,null,null,null,null,null,null,"PUERTO MONTT"]
[222,"Falta información",null,null,null,null,null,null,null,null,null,null,null,null,null,null,null,null,null,"PUERTO OCTAY"]
[223,"Falta información",null,null,null,null,null,null,null,null,null,null,null,null,null,null,null,null,null,"PUERTO VARAS"]
[224,"Falta información",null,null,null,null,null,null,null,null,null,null,null,null,null,null,null,null,null,"PUMANQUE"]
[225,"Falta información",null,null,null,null,null,null,null,null,null,null,null,null,null,null,null,null,null,"PUNITAQUI"]
[226,"Falta información",null,null,null,null,null,null,null,null,null,null,null,null,null,null,null,null,null,"PUNTA ARENAS"]
[227,"Falta información",null,null,null,null,null,null,null,null,null,null,null,null,null,null,null,null,null,"PUQUELDON"]
[228,"Falta información",null,null,null,null,null,null,null,null,null,null,null,null,null,null,null,null,null,"PUREN"]
[229,"Falta información",null,null,null,null,null,null,null,null,null,null,null,null,null,null,null,null,null,"PURRANQUE"]
[230,"Falta información",null,null,null,null,null,null,null,null,null,null,null,null,null,null,null,null,null,"PUTAENDO"]
[231,"Falta información",null,null,null,null,null,null,null,null,null,null,null,null,null,null,null,null,null,"PUTRE"]
[232,"Falta información",null,null,null,null,null,null,null,null,null,null,null,null,null,null,null,null,null,"PUYEHUE"]
[233,"Falta información",null,null,null,null,null,null,null,null,null,null,null,null,null,null,null,null,null,"QUEILEN"]
[234,"Falta información",null,null,null,null,null,null,null,null,null,null,null,null,null,null,null,null,null,"QUELLON"]
[235,"Falta información",null,null,null,null,null,null,null,null,null,null,null,null,null,null,null,null,null,"QUEMCHI"]
[236,"Falta información",null,null,null,null,null,null,null,null,null,null,null,null,null,null,null,null,null,"QUILACO"]
[237,"Falta información",null,null,null,null,null,null,null,null,null,null,null,null,null,null,null,null,null,"QUILICURA"]
[238,"Falta información",null,null,null,null,null,null,null,null,null,null,null,null,null,null,null,null,null,"QUILLECO"]
[239,"Falta información",null,null,null,null,null,null,null,null,null,null,null,null,null,null,null,null,null,"QUILLON"]
[240,"Falta información",null,null,null,null,null,null,null,null,null,null,null,null,null,null,null,null,null,"QUILLOTA"]
[241,"Falta información",null,null,null,null,null,null,null,null,null,null,null,null,null,null,null,null,null,"QUILPUE"]
[242,"Falta información",null,null,null,null,null,null,null,null,null,null,null,null,null,null,null,null,null,"QUINCHAO"]
[243,"Falta información",null,null,null,null,null,null,null,null,null,null,null,null,null,null,null,null,null,"QUINTA DE TILCOCO"]
[244,"Falta información",null,null,null,null,null,null,null,null,null,null,null,null,null,null,null,null,null,"QUINTA NORMAL"]
[245,"Falta información",null,null,null,null,null,null,null,null,null,null,null,null,null,null,null,null,null,"QUINTERO"]
[246,"Falta información",null,null,null,null,null,null,null,null,null,null,null,null,null,null,null,null,null,"QUIRIHUE"]
[247,"Falta información",null,null,null,null,null,null,null,null,null,null,null,null,null,null,null,null,null,"RANCAGUA"]
[248,"Falta información",null,null,null,null,null,null,null,null,null,null,null,null,null,null,null,null,null,"RANQUIL"]
[249,"Falta información",null,null,null,null,null,null,null,null,null,null,null,null,null,null,null,null,null,"RAUCO"]
[250,"Falta información",null,null,null,null,null,null,null,null,null,null,null,null,null,null,null,null,null,"RECOLETA"]
[251,"Falta información",null,null,null,null,null,null,null,null,null,null,null,null,null,null,null,null,null,"RENAICO"]
[252,"Falta información",null,null,null,null,null,null,null,null,null,null,null,null,null,null,null,null,null,"RENCA"]
[253,"Falta información",null,null,null,null,null,null,null,null,null,null,null,null,null,null,null,null,null,"RENGO"]
[254,"Falta información",null,null,null,null,null,null,null,null,null,null,null,null,null,null,null,null,null,"REQUINOA"]
[255,"Falta información",null,null,null,null,null,null,null,null,null,null,null,null,null,null,null,null,null,"RETIRO"]
[256,"Falta información",null,null,null,null,null,null,null,null,null,null,null,null,null,null,null,null,null,"RINCONADA"]
[257,"Falta información",null,null,null,null,null,null,null,null,null,null,null,null,null,null,null,null,null,"RIO BUENO"]
[258,{"$f":"IF(E266=\"No\",IF(COUNTBLANK(C266:M266)=0,\"Completo\",IF(COUNTBLANK(C266:M266)=10,\"\",\"Falta información\")),IF(E266=\"Si\",IF(COUNTBLANK(C266:M266)=4,\"Completo\",IF(COUNTBLANK(C266:M266)=10,\"\",\"Falta información\")),\"Falta información\"))","v":"Falta información"},null,null,null,null,null,null,null,null,null,null,null,null,null,null,null,null,null,"RIO CLARO"]
[259,"Falta información",null,null,null,null,null,null,null,null,null,null,null,null,null,null,null,null,null,"RIO HURTADO"]
[260,"Falta información",null,null,null,null,null,null,null,null,null,null,null,null,null,null,null,null,null,"RIO IBAÑEZ"]
[261,"Falta información",null,null,null,null,null,null,null,null,null,null,null,null,null,null,null,null,null,"RIO NEGRO"]
[262,"Falta información",null,null,null,null,null,null,null,null,null,null,null,null,null,null,null,null,null,"RIO VERDE"]
[263,"Falta información",null,null,null,null,null,null,null,null,null,null,null,null,null,null,null,null,null,"ROMERAL"]
[264,"Falta información",null,null,null,null,null,null,null,null,null,null,null,null,null,null,null,null,null,"SAAVEDRA"]
[265,"Falta información",null,null,null,null,null,null,null,null,null,null,null,null,null,null,null,null,null,"SAGRADA FAMILIA"]
[266,"Falta información",null,null,null,null,null,null,null,null,null,null,null,null,null,null,null,null,null,"SALAMANCA"]
[267,"Falta información",null,null,null,null,null,null,null,null,null,null,null,null,null,null,null,null,null,"SAN ANTONIO"]
[268,"Falta información",null,null,null,null,null,null,null,null,null,null,null,null,null,null,null,null,null,"SAN BERNARDO"]
[269,"Falta información",null,null,null,null,null,null,null,null,null,null,null,null,null,null,null,null,null,"SAN CARLOS"]
[270,"Falta información",null,null,null,null,null,null,null,null,null,null,null,null,null,null,null,null,null,"SAN CLEMENTE"]
[271,"Falta información",null,null,null,null,null,null,null,null,null,null,null,null,null,null,null,null,null,"SAN ESTEBAN"]
[272,"Falta información",null,null,null,null,null,null,null,null,null,null,null,null,null,null,null,null,null,"SAN FABIAN"]
[273,"Falta información",null,null,null,null,null,null,null,null,null,null,null,null,null,null,null,null,null,"SAN FELIPE"]
[274,"Falta información",null,null,null,null,null,null,null,null,null,null,null,null,null,null,null,null,null,"SAN FERNANDO"]
[275,"Falta información",null,null,null,null,null,null,null,null,null,null,null,null,null,null,null,null,null,"SAN GREGORIO"]
[276,"Falta información",null,null,null,null,null,null,null,null,null,null,null,null,null,null,null,null,null,"SAN IGNACIO"]
[277,"Falta información",null,null,null,null,null,null,null,null,null,null,null,null,null,null,null,null,null,"SAN JAVIER"]
[278,"Falta información",null,null,null,null,null,null,null,null,null,null,null,null,null,null,null,null,null,"SAN JOAQUIN"]
[279,"Falta información",null,null,null,null,null,null,null,null,null,null,null,null,null,null,null,null,null,"SAN JOSE DE MAIPO"]
[280,"Falta información",null,null,null,null,null,null,null,null,null,null,null,null,null,null,null,null,null,"SAN JUAN DE LA COSTA"]
[281,"Falta información",null,null,null,null,null,null,null,null,null,null,null,null,null,null,null,null,null,"SAN MIGUEL"]
[282,"Falta información",null,null,null,null,null,null,null,null,null,null,null,null,null,null,null,null,null,"SAN NICOLAS"]
[283,"Falta información",null,null,null,null,null,null,null,null,null,null,null,null,null,null,null,null,null,"SAN PABLO"]
[284,"Falta información",null,null,null,null,null,null,null,null,null,null,null,null,null,null,null,null,null,"SAN PEDRO"]
[285,"Falta información",null,null,null,null,null,null,null,null,null,null,null,null,null,null,null,null,null,"SAN PEDRO DE ATACAMA"]
[286,"Falta información",null,null,null,null,null,null,null,null,null,null,null,null,null,null,null,null,null,"SAN PEDRO DE LA PAZ"]
[287,"Falta información",null,null,null,null,null,null,null,null,null,null,null,null,null,null,null,null,null,"SAN RAFAEL"]
[288,"Falta información",null,null,null,null,null,null,null,null,null,null,null,null,null,null,null,null,null,"SAN RAMON"]
[289,"Falta información",null,null,null,null,null,null,null,null,null,null,null,null,null,null,null,null,null,"SAN ROSENDO"]
[290,"Falta información",null,null,null,null,null,null,null,null,null,null,null,null,null,null,null,null,null,"SAN VICENTE"]
[291,"Falta información",null,null,null,null,null,null,null,null,null,null,null,null,null,null,null,null,null,"SANTA BARBARA"]
[292,"Falta información",null,null,null,null,null,null,null,null,null,null,null,null,null,null,null,null,null,"SANTA CRUZ"]
[293,"Falta información",null,null,null,null,null,null,null,null,null,null,null,null,null,null,null,null,null,"SANTA JUANA"]
[294,"Falta información",null,null,null,null,null,null,null,null,null,null,null,null,null,null,null,null,null,"SANTA MARIA"]
[295,"Falta información",null,null,null,null,null,null,null,null,null,null,null,null,null,null,null,null,null,"SANTIAGO"]
[296,"Falta información",null,null,null,null,null,null,null,null,null,null,null,null,null,null,null,null,null,"SANTO DOMINGO"]
[297,"Falta información",null,null,null,null,null,null,null,null,null,null,null,null,null,null,null,null,null,"SIERRA GORDA"]
[298,"Falta información",null,null,null,null,null,null,null,null,null,null,null,null,null,null,null,null,null,"TALAGANTE"]
[299,"Falta información",null,null,null,null,null,null,null,null,null,null,null,null,null,null,null,null,null,"TALCA"]
[300,"Falta información",null,null,null,null,null,null,null,null,null,null,null,null,null,null,null,null,null,"TALCAHUANO"]
[301,"Falta información",null,null,null,null,null,null,null,null,null,null,null,null,null,null,null,null,null,"TALTAL"]
[302,"Falta información",null,null,null,null,null,null,null,null,null,null,null,null,null,null,null,null,null,"TEMUCO"]
[303,"Falta información",null,null,null,null,null,null,null,null,null,null,null,null,null,null,null,null,null,"TENO"]
[304,"Falta información",null,null,null,null,null,null,null,null,null,null,null,null,null,null,null,null,null,"TEODORO SCHMIDT"]
[305,"Falta información",null,null,null,null,null,null,null,null,null,null,null,null,null,null,null,null,null,"TIERRA AMARILLA"]
[306,"Falta información",null,null,null,null,null,null,null,null,null,null,null,null,null,null,null,null,null,"TILTIL"]
[307,"Falta información",null,null,null,null,null,null,null,null,null,null,null,null,null,null,null,null,null,"TIRUA"]
[308,"Falta información",null,null,null,null,null,null,null,null,null,null,null,null,null,null,null,null,null,"TOCOPILLA"]
[309,"Falta información",null,null,null,null,null,null,null,null,null,null,null,null,null,null,null,null,null,"TOLTEN"]
[310,"Falta información",null,null,null,null,null,null,null,null,null,null,null,null,null,null,null,null,null,"TOME"]
[311,"Falta información",null,null,null,null,null,null,null,null,null,null,null,null,null,null,null,null,null,"TORTEL"]
[312,"Falta información",null,null,null,null,null,null,null,null,null,null,null,null,null,null,null,null,null,"TRAIGUEN"]
[313,"Falta información",null,null,null,null,null,null,null,null,null,null,null,null,null,null,null,null,null,"TREGUACO"]
[314,"Falta información",null,null,null,null,null,null,null,null,null,null,null,null,null,null,null,null,null,"TUCAPEL"]
[315,"Falta información",null,null,null,null,null,null,null,null,null,null,null,null,null,null,null,null,null,"VALDIVIA"]
[316,"Falta información",null,null,null,null,null,null,null,null,null,null,null,null,null,null,null,null,null,"VALLENAR"]
[317,"Falta información",null,null,null,null,null,null,null,null,null,null,null,null,null,null,null,null,null,"VALPARAISO"]
[318,"Falta información",null,null,null,null,null,null,null,null,null,null,null,null,null,null,null,null,null,"VICHUQUEN"]
[319,"Falta información",null,null,null,null,null,null,null,null,null,null,null,null,null,null,null,null,null,"VICTORIA"]
[320,"Falta información",null,null,null,null,null,null,null,null,null,null,null,null,null,null,null,null,null,"VICUÑA"]
[321,"Falta información",null,null,null,null,null,null,null,null,null,null,null,null,null,null,null,null,null,"VIÑA DEL MAR"]
[322,{"$f":"IF(E330=\"No\",IF(COUNTBLANK(C330:M330)=0,\"Completo\",IF(COUNTBLANK(C330:M330)=10,\"\",\"Falta información\")),IF(E330=\"Si\",IF(COUNTBLANK(C330:M330)=4,\"Completo\",IF(COUNTBLANK(C330:M330)=10,\"\",\"Falta información\")),\"Falta información\"))","v":"Falta información"},null,null,null,null,null,null,null,null,null,null,null,null,null,null,null,null,null,"VILCUN"]
[323,"Falta información",null,null,null,null,null,null,null,null,null,null,null,null,null,null,null,null,null,"VILLA ALEGRE"]
[324,"Falta información",null,null,null,null,null,null,null,null,null,null,null,null,null,null,null,null,null,"VILLA ALEMANA"]
[325,"Falta información",null,null,null,null,null,null,null,null,null,null,null,null,null,null,null,null,null,"VILLARRICA"]
[326,"Falta información",null,null,null,null,null,null,null,null,null,null,null,null,null,null,null,null,null,"VITACURA"]
[327,"Falta información",null,null,null,null,null,null,null,null,null,null,null,null,null,null,null,null,null,"YERBAS BUENAS"]
[328,"Falta información",null,null,null,null,null,null,null,null,null,null,null,null,null,null,null,null,null,"YUMBEL"]
[329,"Falta información",null,null,null,null,null,null,null,null,null,null,null,null,null,null,null,null,null,"YUNGAY"]
[330,"Falta información",null,null,null,null,null,null,null,null,null,null,null,null,null,null,null,null,null,"ZAPALLAR"]
[331,"Falta información"]
[332,"Falta información"]
[333,"Falta información"]
[334,"Falta información"]
[335,"Falta información"]
[336,"Falta información"]
[337,"Falta información"]
[338,"Falta información"]
[339,"Falta información"]
[340,"Falta información"]
[341,"Falta información"]
[342,"Falta información"]
[343,"Falta información"]
[344,"Falta información"]
[345,"Falta información"]
[346,"Falta información"]
[347,"Falta información"]
[348,"Falta información"]
[349,"Falta información"]
[350,"Falta información"]
[351,"Falta información"]
[352,"Falta información"]
[353,"Falta información"]
[354,"Falta información"]
[355,"Falta información"]
[356,"Falta información"]
[357,"Falta información"]
[358,"Falta información"]
[359,"Falta información"]
[360,"Falta información"]
[361,"Falta información"]
[362,"Falta información"]
[363,"Falta información"]
[364,"Falta información"]
[365,"Falta información"]
[366,"Falta información"]
[367,"Falta información"]
[368,"Falta información"]
[369,"Falta información"]
[370,"Falta información"]
[371,"Falta información"]
[372,"Falta información"]
[373,"Falta información"]
[374,"Falta información"]
[375,"Falta información"]
[376,"Falta información"]
[377,"Falta información"]
[378,"Falta información"]
[379,"Falta información"]
[380,"Falta información"]
[381,"Falta información"]
[382,"Falta información"]
[383,"Falta información"]
[384,"Falta información"]
[385,"Falta información"]
[386,{"$f":"IF(E394=\"No\",IF(COUNTBLANK(C394:M394)=0,\"Completo\",IF(COUNTBLANK(C394:M394)=10,\"\",\"Falta información\")),IF(E394=\"Si\",IF(COUNTBLANK(C394:M394)=4,\"Completo\",IF(COUNTBLANK(C394:M394)=10,\"\",\"Falta información\")),\"Falta información\"))","v":"Falta información"}]
[387,"Falta información"]
[388,"Falta información"]
[389,"Falta información"]
[390,"Falta información"]
[391,"Falta información"]
[392,"Falta información"]
[393,"Falta información"]
[394,"Falta información"]
[395,"Falta información"]
[396,"Falta información"]
[397,"Falta información"]
[398,"Falta información"]
[399,"Falta información"]
[400,"Falta información"]
[401,"Falta información"]
[402,"Falta información"]
[403,"Falta información"]
[404,"Falta información"]
[405,"Falta información"]
[406,"Falta información"]
[407,"Falta información"]
[408,"Falta información"]
[409,"Falta información"]
[410,"Falta información"]
[411,"Falta información"]
[412,"Falta información"]
[413,"Falta información"]
[414,"Falta información"]
[415,"Falta información"]
[416,"Falta información"]
[417,"Falta información"]
[418,"Falta información"]
[419,"Falta información"]
[420,"Falta información"]
[421,"Falta información"]
[422,"Falta información"]
[423,"Falta información"]
[424,"Falta información"]
[425,"Falta información"]
[426,"Falta información"]
[427,"Falta información"]
[428,"Falta información"]
[429,"Falta información"]
[430,"Falta información"]
[431,"Falta información"]
[432,"Falta información"]
[433,"Falta información"]
[434,"Falta información"]
[435,"Falta información"]
[436,"Falta información"]
[437,"Falta información"]
[438,"Falta información"]
[439,"Falta información"]
[440,"Falta información"]
[441,"Falta información"]
[442,"Falta información"]
[443,"Falta información"]
[444,"Falta información"]
[445,"Falta información"]
[446,"Falta información"]
[447,"Falta información"]
[448,"Falta información"]
[449,"Falta información"]
[450,{"$f":"IF(E458=\"No\",IF(COUNTBLANK(C458:M458)=0,\"Completo\",IF(COUNTBLANK(C458:M458)=10,\"\",\"Falta información\")),IF(E458=\"Si\",IF(COUNTBLANK(C458:M458)=4,\"Completo\",IF(COUNTBLANK(C458:M458)=10,\"\",\"Falta información\")),\"Falta información\"))","v":"Falta información"}]
[451,"Falta información"]
[452,"Falta información"]
[453,"Falta información"]
[454,"Falta información"]
[455,"Falta información"]
[456,"Falta información"]
[457,"Falta información"]
[458,"Falta información"]
[459,"Falta información"]
[460,"Falta información"]
[461,"Falta información"]
[462,"Falta información"]
[463,"Falta información"]
[464,"Falta información"]
[465,"Falta información"]
[466,"Falta información"]
[467,"Falta información"]
[468,"Falta información"]
[469,"Falta información"]
[470,"Falta información"]
[471,"Falta información"]
[472,"Falta información"]
[473,"Falta información"]
[474,"Falta información"]
[475,"Falta información"]
[476,"Falta información"]
[477,"Falta información"]
[478,"Falta información"]
[479,"Falta información"]
[480,"Falta información"]
[481,"Falta información"]
[482,"Falta información"]
[483,"Falta información"]
[484,"Falta información"]
[485,"Falta información"]
[486,"Falta información"]
[487,"Falta información"]
[488,"Falta información"]
[489,"Falta información"]
[490,"Falta información"]
[491,"Falta información"]
[492,"Falta información"]
[493,"Falta información"]
[494,"Falta información"]
[495,"Falta información"]
[496,"Falta información"]
[497,"Falta información"]
[498,"Falta información"]
[499,"Falta información"]
[500,"Falta información"]
[501,"Falta información"]
[502,"Falta información"]
[503,"Falta información"]
[504,"Falta información"]
[505,"Falta información"]
[506,"Falta información"]
[507,"Falta información"]
[508,"Falta información"]
[509,"Falta información"]
[510,"Falta información"]
[511,"Falta información"]
[512,"Falta información"]
[513,"Falta información"]
[514,{"$f":"IF(E522=\"No\",IF(COUNTBLANK(C522:M522)=0,\"Completo\",IF(COUNTBLANK(C522:M522)=10,\"\",\"Falta información\")),IF(E522=\"Si\",IF(COUNTBLANK(C522:M522)=4,\"Completo\",IF(COUNTBLANK(C522:M522)=10,\"\",\"Falta información\")),\"Falta información\"))","v":"Falta información"}]
[515,"Falta información"]
[516,"Falta información"]
[517,"Falta información"]
[518,"Falta información"]
[519,"Falta información"]
[520,"Falta información"]
[521,"Falta información"]
[522,"Falta información"]
[523,"Falta información"]
[524,"Falta información"]
[525,"Falta información"]
[526,"Falta información"]
[527,"Falta información"]
[528,"Falta información"]
[529,"Falta información"]
[530,"Falta información"]
[531,"Falta información"]
[532,"Falta información"]
[533,"Falta información"]
[534,"Falta información"]
[535,"Falta información"]
[536,"Falta información"]
[537,"Falta información"]
[538,"Falta información"]
[539,"Falta información"]
[540,"Falta información"]
[541,"Falta información"]
[542,"Falta información"]
[543,"Falta información"]
[544,"Falta información"]
[545,"Falta información"]
[546,"Falta información"]
[547,"Falta información"]
[548,"Falta información"]
[549,"Falta información"]
[550,"Falta información"]
[551,"Falta información"]
[552,"Falta información"]
[553,"Falta información"]
[554,"Falta información"]
[555,"Falta información"]
[556,"Falta información"]
[557,"Falta información"]
[558,"Falta información"]
[559,"Falta información"]
[560,"Falta información"]
[561,"Falta información"]
[562,"Falta información"]
[563,"Falta información"]
[564,"Falta información"]
[565,"Falta información"]
[566,"Falta información"]
[567,"Falta información"]
[568,"Falta información"]
[569,"Falta información"]
[570,"Falta información"]
[571,"Falta información"]
[572,"Falta información"]
[573,"Falta información"]
[574,"Falta información"]
[575,"Falta información"]
[576,"Falta información"]
[577,"Falta información"]
[578,{"$f":"IF(E586=\"No\",IF(COUNTBLANK(C586:M586)=0,\"Completo\",IF(COUNTBLANK(C586:M586)=10,\"\",\"Falta información\")),IF(E586=\"Si\",IF(COUNTBLANK(C586:M586)=4,\"Completo\",IF(COUNTBLANK(C586:M586)=10,\"\",\"Falta información\")),\"Falta información\"))","v":"Falta información"}]
[579,"Falta información"]
[580,"Falta información"]
[581,"Falta información"]
[582,"Falta información"]
[583,"Falta información"]
[584,"Falta información"]
[585,"Falta información"]
[586,"Falta información"]
[587,"Falta información"]
[588,"Falta información"]
[589,"Falta información"]
[590,"Falta información"]
[591,"Falta información"]
[592,"Falta información"]
[593,"Falta información"]
[594,"Falta información"]
[595,"Falta información"]
[596,"Falta información"]
[597,"Falta información"]
[598,"Falta información"]
[599,"Falta información"]
[600,"Falta información"]
[601,"Falta información"]
[602,"Falta información"]
[603,"Falta información"]
[604,"Falta información"]
[605,"Falta información"]
[606,"Falta información"]
[607,"Falta información"]
[608,"Falta información"]
[609,"Falta información"]
[610,"Falta información"]
[611,"Falta información"]
[612,"Falta información"]
[613,"Falta información"]
[614,"Falta información"]
[615,"Falta información"]
[616,"Falta información"]
[617,"Falta información"]
[618,"Falta información"]
[619,"Falta información"]
[620,"Falta información"]
[621,"Falta información"]
[622,"Falta información"]
[623,"Falta información"]
[624,"Falta información"]
[625,"Falta información"]
[626,"Falta información"]
[627,"Falta información"]
[628,"Falta información"]
[629,"Falta información"]
[630,"Falta información"]
[631,"Falta información"]
[632,"Falta información"]
[633,"Falta información"]
[634,"Falta información"]
[635,"Falta información"]
[636,"Falta información"]
[637,"Falta información"]
[638,"Falta información"]
[639,"Falta información"]
[640,"Falta información"]
[641,"Falta información"]
[642,{"$f":"IF(E650=\"No\",IF(COUNTBLANK(C650:M650)=0,\"Completo\",IF(COUNTBLANK(C650:M650)=10,\"\",\"Falta información\")),IF(E650=\"Si\",IF(COUNTBLANK(C650:M650)=4,\"Completo\",IF(COUNTBLANK(C650:M650)=10,\"\",\"Falta información\")),\"Falta información\"))","v":"Falta información"}]
[643,"Falta información"]
[644,"Falta información"]
[645,"Falta información"]
[646,"Falta información"]
[647,"Falta información"]
[648,"Falta información"]
[649,"Falta información"]
[650,"Falta información"]
[651,"Falta información"]
[652,"Falta información"]
[653,"Falta información"]
[654,"Falta información"]
[655,"Falta información"]
[656,"Falta información"]
[657,"Falta información"]
[658,"Falta información"]
[659,"Falta información"]
[660,"Falta información"]
[661,"Falta información"]
[662,"Falta información"]
[663,"Falta información"]
[664,"Falta información"]
[665,"Falta información"]
[666,"Falta información"]
[667,"Falta información"]
[668,"Falta información"]
[669,"Falta información"]
[670,"Falta información"]
[671,"Falta información"]
[672,"Falta información"]
[673,"Falta información"]
[674,"Falta información"]
[675,"Falta información"]
[676,"Falta información"]
[677,"Falta información"]
[678,"Falta información"]
[679,"Falta información"]
[680,"Falta información"]
[681,"Falta información"]
[682,"Falta información"]
[683,"Falta información"]
[684,"Falta información"]
[685,"Falta información"]
[686,"Falta información"]
[687,"Falta información"]
[688,"Falta información"]
[689,"Falta información"]
[690,"Falta información"]
[691,"Falta información"]
[692,"Falta información"]
[693,"Falta información"]
[694,"Falta información"]
[695,"Falta información"]
[696,"Falta información"]
[697,"Falta información"]
[698,"Falta información"]
[699,"Falta información"]
[700,"Falta información"]
[701,"Falta información"]
[702,"Falta información"]
[703,"Falta información"]
[704,"Falta información"]
[705,"Falta información"]
[706,{"$f":"IF(E714=\"No\",IF(COUNTBLANK(C714:M714)=0,\"Completo\",IF(COUNTBLANK(C714:M714)=10,\"\",\"Falta información\")),IF(E714=\"Si\",IF(COUNTBLANK(C714:M714)=4,\"Completo\",IF(COUNTBLANK(C714:M714)=10,\"\",\"Falta información\")),\"Falta información\"))","v":"Falta información"}]
[707,"Falta información"]
[708,"Falta información"]
[709,"Falta información"]
[710,"Falta información"]
[711,"Falta información"]
[712,"Falta información"]
[713,"Falta información"]
[714,"Falta información"]
[715,"Falta información"]
[716,"Falta información"]
[717,"Falta información"]
[718,"Falta información"]
[719,"Falta información"]
[720,"Falta información"]
[721,"Falta información"]
[722,"Falta información"]
[723,"Falta información"]
[724,"Falta información"]
[725,"Falta información"]
[726,"Falta información"]
[727,"Falta información"]
[728,"Falta información"]
[729,"Falta información"]
[730,"Falta información"]
[731,"Falta información"]
[732,"Falta información"]
[733,"Falta información"]
[734,"Falta información"]
[735,"Falta información"]
[736,"Falta información"]
[737,"Falta información"]
[738,"Falta información"]
[739,"Falta información"]
[740,"Falta información"]
[741,"Falta información"]
[742,"Falta información"]
[743,"Falta información"]
[744,"Falta información"]
[745,"Falta información"]
[746,"Falta información"]
[747,"Falta información"]
[748,"Falta información"]
[749,"Falta información"]
[750,"Falta información"]
[751,"Falta información"]
[752,"Falta información"]
[753,"Falta información"]
[754,"Falta información"]
[755,"Falta información"]
[756,"Falta información"]
[757,"Falta información"]
[758,"Falta información"]
[759,"Falta información"]
[760,"Falta información"]
[761,"Falta información"]
[762,"Falta información"]
[763,"Falta información"]
[764,"Falta información"]
[765,"Falta información"]
[766,"Falta información"]
[767,"Falta información"]
[768,"Falta información"]
[769,"Falta información"]
[770,{"$f":"IF(E778=\"No\",IF(COUNTBLANK(C778:M778)=0,\"Completo\",IF(COUNTBLANK(C778:M778)=10,\"\",\"Falta información\")),IF(E778=\"Si\",IF(COUNTBLANK(C778:M778)=4,\"Completo\",IF(COUNTBLANK(C778:M778)=10,\"\",\"Falta información\")),\"Falta información\"))","v":"Falta información"}]
[771,"Falta información"]
[772,"Falta información"]
[773,"Falta información"]
[774,"Falta información"]
[775,"Falta información"]
[776,"Falta información"]
[777,"Falta información"]
[778,"Falta información"]
[779,"Falta información"]
[780,"Falta información"]
[781,"Falta información"]
[782,"Falta información"]
[783,"Falta información"]
[784,"Falta información"]
[785,"Falta información"]
[786,"Falta información"]
[787,"Falta información"]
[788,"Falta información"]
[789,"Falta información"]
[790,"Falta información"]
[791,"Falta información"]
[792,"Falta información"]
[793,"Falta información"]
[794,"Falta información"]
[795,"Falta información"]
[796,"Falta información"]
[797,"Falta información"]
[798,"Falta información"]
[799,"Falta información"]
[800,"Falta información"]
[801,"Falta información"]
[802,"Falta información"]
[803,"Falta información"]
[804,"Falta información"]
[805,"Falta información"]
[806,"Falta información"]
[807,"Falta información"]
[808,"Falta información"]
[809,"Falta información"]
[810,"Falta información"]
[811,"Falta información"]
[812,"Falta información"]
[813,"Falta información"]
[814,"Falta información"]
[815,"Falta información"]
[816,"Falta información"]
[817,"Falta información"]
[818,"Falta información"]
[819,"Falta información"]
[820,"Falta información"]
[821,"Falta información"]
[822,"Falta información"]
[823,"Falta información"]
[824,"Falta información"]
[825,"Falta información"]
[826,"Falta información"]
[827,"Falta información"]
[828,"Falta información"]
[829,"Falta información"]
[830,"Falta información"]
[831,"Falta información"]
[832,"Falta información"]
[833,"Falta información"]
[834,{"$f":"IF(E842=\"No\",IF(COUNTBLANK(C842:M842)=0,\"Completo\",IF(COUNTBLANK(C842:M842)=10,\"\",\"Falta información\")),IF(E842=\"Si\",IF(COUNTBLANK(C842:M842)=4,\"Completo\",IF(COUNTBLANK(C842:M842)=10,\"\",\"Falta información\")),\"Falta información\"))","v":"Falta información"}]
[835,"Falta información"]
[836,"Falta información"]
[837,"Falta información"]
[838,"Falta información"]
[839,"Falta información"]
[840,"Falta información"]
[841,"Falta información"]
[842,"Falta información"]
[843,"Falta información"]
[844,"Falta información"]
[845,"Falta información"]
[846,"Falta información"]
[847,"Falta información"]
[848,"Falta información"]
[849,"Falta información"]
[850,"Falta información"]
[851,"Falta información"]
[852,"Falta información"]
[853,"Falta información"]
[854,"Falta información"]
[855,"Falta información"]
[856,"Falta información"]
[857,"Falta información"]
[858,"Falta información"]
[859,"Falta información"]
[860,"Falta información"]
[861,"Falta información"]
[862,"Falta información"]
[863,"Falta información"]
[864,"Falta información"]
[865,"Falta información"]
[866,"Falta información"]
[867,"Falta información"]
[868,"Falta información"]
[869,"Falta información"]
[870,"Falta información"]
[871,"Falta información"]
[872,"Falta información"]
[873,"Falta información"]
[874,"Falta información"]
[875,"Falta información"]
[876,"Falta información"]
[877,"Falta información"]
[878,"Falta información"]
[879,"Falta información"]
[880,"Falta información"]
[881,"Falta información"]
[882,"Falta información"]
[883,"Falta información"]
[884,"Falta información"]
[885,"Falta información"]
[886,"Falta información"]
[887,"Falta información"]
[888,"Falta información"]
[889,"Falta información"]
[890,"Falta información"]
[891,"Falta información"]
[892,"Falta información"]
[893,"Falta información"]
[894,"Falta información"]
[895,"Falta información"]
[896,"Falta información"]
[897,"Falta información"]
[898,{"$f":"IF(E906=\"No\",IF(COUNTBLANK(C906:M906)=0,\"Completo\",IF(COUNTBLANK(C906:M906)=10,\"\",\"Falta información\")),IF(E906=\"Si\",IF(COUNTBLANK(C906:M906)=4,\"Completo\",IF(COUNTBLANK(C906:M906)=10,\"\",\"Falta información\")),\"Falta información\"))","v":"Falta información"}]
[899,"Falta información"]
[900,"Falta información"]
[901,"Falta información"]
[902,"Falta información"]
[903,"Falta información"]
[904,"Falta información"]
[905,"Falta información"]
[906,"Falta información"]
[907,"Falta información"]
[908,"Falta información"]
[909,"Falta información"]
[910,"Falta información"]
[911,"Falta información"]
[912,"Falta información"]
[913,"Falta información"]
[914,"Falta información"]
[915,"Falta información"]
[916,"Falta información"]
[917,"Falta información"]
[918,"Falta información"]
[919,"Falta información"]
[920,"Falta información"]
[921,"Falta información"]
[922,"Falta información"]
[923,"Falta información"]
[924,"Falta información"]
[925,"Falta información"]
[926,"Falta información"]
[927,"Falta información"]
[928,"Falta información"]
[929,"Falta información"]
[930,"Falta información"]
[931,"Falta información"]
[932,"Falta información"]
[933,"Falta información"]
[934,"Falta información"]
[935,"Falta información"]
[936,"Falta información"]
[937,"Falta información"]
[938,"Falta información"]
[939,"Falta información"]
[940,"Falta información"]
[941,"Falta información"]
[942,"Falta información"]
[943,"Falta información"]
[944,"Falta información"]
[945,"Falta información"]
[946,"Falta información"]
[947,"Falta información"]
[948,"Falta información"]
[949,"Falta información"]
[950,"Falta información"]
[951,"Falta información"]
[952,"Falta información"]
[953,"Falta información"]
[954,"Falta información"]
[955,"Falta información"]
[956,"Falta información"]
[957,"Falta información"]
[958,"Falta información"]
[959,"Falta información"]
[960,"Falta información"]
[961,"Falta información"]
[962,{"$f":"IF(E970=\"No\",IF(COUNTBLANK(C970:M970)=0,\"Completo\",IF(COUNTBLANK(C970:M970)=10,\"\",\"Falta información\")),IF(E970=\"Si\",IF(COUNTBLANK(C970:M970)=4,\"Completo\",IF(COUNTBLANK(C970:M970)=10,\"\",\"Falta información\")),\"Falta información\"))","v":"Falta información"}]
[963,"Falta información"]
[964,"Falta información"]
[965,"Falta información"]
[966,"Falta información"]
[967,"Falta información"]
[968,"Falta información"]
[969,"Falta información"]
[970,"Falta información"]
[971,"Falta información"]
[972,"Falta información"]
[973,"Falta información"]
[974,"Falta información"]
[975,"Falta información"]
[976,"Falta información"]
[977,"Falta información"]
[978,"Falta información"]
[979,"Falta información"]
[980,"Falta información"]
[981,"Falta información"]
[982,"Falta información"]
[983,"Falta información"]
[984,"Falta información"]
[985,"Falta información"]
[986,"Falta información"]
[987,"Falta información"]
[988,"Falta información"]
[989,"Falta información"]
[990,"Falta información"]
[991,"Falta información"]
[992,"Falta información"]
[993,"Falta información"]
[994,"Falta información"]
[995,"Falta información"]
[996,"Falta información"]
[997,"Falta información"]
[998,"Falta información"]
[999,"Falta información"]
[1000,"Falta información"]